12-12 15:02:01 D/Configuration: Resolve and download remote files from @Option
12-12 15:02:01 I/TestInvocation: Invocation was started with cmd: cts-on-gsi -m CtsAppTestCases -t android.app.cts.DownloadManagerTest#testDownloadManagerSupportsHttpsWithExternalWebServer -s SKBFX9C72AA
12-12 15:02:01 D/InvocationExecution: Skip linking external directory as FileProperty was set.
12-12 15:02:01 D/RunUtil: Running command [adb, version] with timeout: 2m 0s
12-12 15:02:01 D/TestInvocation: Fetch build duration: 14 ms
12-12 15:02:01 D/ArtifactsAnalyzer: Build analysis report: BuildAnalysis [mDeviceImageChanged=true, mHasTestsArtifacts=true, mHasChangesInTests=false, imageDigests={}, artifactDigests={}]
12-12 15:02:01 D/ArtifactsAnalyzer: Analysis report after test analysis: BuildAnalysis [mDeviceImageChanged=true, mHasTestsArtifacts=true, mHasChangesInTests=true, imageDigests={}, artifactDigests={testsdir=null}]
12-12 15:02:01 D/RunUtil: Running command [adb, -s, SKBFX9C72AA, shell, getprop, ro.build.version.sdk] with timeout: 45s
12-12 15:02:01 D/GlobalTestFilter: Setting up global filters
12-12 15:02:01 D/InvocationExecution: IShardHelper selected: com.android.tradefed.invoker.shard.StrictShardHelper@4d132135
12-12 15:02:01 D/BackgroundDeviceAction: Waiting for device SKBFX9C72AA online before starting.
12-12 15:02:01 D/BackgroundDeviceAction: Device SKBFX9C72AA now online.
12-12 15:02:01 D/BackgroundDeviceAction: Starting logcat for SKBFX9C72AA.
12-12 15:02:01 I/TestInvocation: Starting invocation for 'cts' with '[ DeviceBuildInfo{bid=13441469, serial=SKBFX9C72AA} on device 'SKBFX9C72AA'] 
12-12 15:02:01 D/FileUtil: Creating temp directory at /tmp/13441469/cts with prefix "inv_"
12-12 15:02:01 D/RunUtil: Running command [chmod, ug+rwx, /tmp/13441469/cts/inv_14577056596028725407] with timeout: 10s
12-12 15:02:01 D/FileSystemLogSaver: Using log file directory /tmp/13441469/cts/inv_14577056596028725407
12-12 15:02:01 D/FileUtil: Creating temp directory at /tmp/13441469/cts/inv_14577056596028725407 with prefix "inv_"
12-12 15:02:01 I/LogFileSaver: Using log file directory /tmp/13441469/cts/inv_14577056596028725407/inv_2914749876990745416
12-12 15:02:01 D/CertificationSuiteResultReporter: Initializing result directory
12-12 15:02:01 D/CertificationSuiteResultReporter: Results Directory: /tmp/xts-root-dir-31f7ed76-90d3-4c87-9d46-ebc367af050b/android-cts/results/2025.12.12_15.02.01
12-12 15:02:01 D/CertificationSuiteResultReporter: Created log dir /tmp/xts-root-dir-31f7ed76-90d3-4c87-9d46-ebc367af050b/android-cts/logs/2025.12.12_15.02.01
12-12 15:02:01 D/FileUtil: Creating temp directory at /tmp/xts-root-dir-31f7ed76-90d3-4c87-9d46-ebc367af050b/android-cts/logs/2025.12.12_15.02.01 with prefix "inv_"
12-12 15:02:01 I/LogFileSaver: Using log file directory /tmp/xts-root-dir-31f7ed76-90d3-4c87-9d46-ebc367af050b/android-cts/logs/2025.12.12_15.02.01/inv_8470258709435509936
12-12 15:02:02 D/CompatibilityProtoResultReporter: Proto Results Directory: /tmp/xts-root-dir-31f7ed76-90d3-4c87-9d46-ebc367af050b/android-cts/results/2025.12.12_15.02.01/proto
12-12 15:02:02 D/FileUtil: Creating temp file at /tmp/xts-root-dir-31f7ed76-90d3-4c87-9d46-ebc367af050b/android-cts/results/2025.12.12_15.02.01/proto with prefix "tmp-proto" suffix ""
12-12 15:02:02 D/CompatibilityProtoResultReporter: Proto Results Directory: /tmp/xts-root-dir-31f7ed76-90d3-4c87-9d46-ebc367af050b/android-cts/results/2025.12.12_15.02.01/proto
12-12 15:02:02 D/LogFileSaver: Log data for tradefed-expanded-config is already compressed, skipping compression
12-12 15:02:02 D/FileUtil: Creating temp file at /tmp/xts-root-dir-31f7ed76-90d3-4c87-9d46-ebc367af050b/android-cts/logs/2025.12.12_15.02.01/inv_8470258709435509936 with prefix "tradefed-expanded-config_" suffix ".xml"
12-12 15:02:02 I/LogFileSaver: Saved log file /tmp/xts-root-dir-31f7ed76-90d3-4c87-9d46-ebc367af050b/android-cts/logs/2025.12.12_15.02.01/inv_8470258709435509936/tradefed-expanded-config_3095117480250726476.xml. [size=83599, elapsed=1ms]
12-12 15:02:02 D/CertificationSuiteResultReporter: Saved logs for tradefed-expanded-config in /tmp/xts-root-dir-31f7ed76-90d3-4c87-9d46-ebc367af050b/android-cts/logs/2025.12.12_15.02.01/inv_8470258709435509936/tradefed-expanded-config_3095117480250726476.xml
12-12 15:02:02 D/LogFileSaver: Log data for tradefed-expanded-config is already compressed, skipping compression
12-12 15:02:02 D/FileUtil: Creating temp file at /tmp/13441469/cts/inv_14577056596028725407/inv_2914749876990745416 with prefix "tradefed-expanded-config_" suffix ".xml"
12-12 15:02:02 I/LogFileSaver: Saved log file /tmp/13441469/cts/inv_14577056596028725407/inv_2914749876990745416/tradefed-expanded-config_15971238589548665987.xml. [size=83599, elapsed=1ms]
12-12 15:02:02 D/InvocationExecution: Starting device pre invocation setup for : 'SKBFX9C72AA'
12-12 15:02:02 D/DefaultConnection: Instance type for connection: GCE
12-12 15:02:02 D/DefaultConnection: Instance type for connection: GCE. Evaluating for connection type.
12-12 15:02:02 D/NativeDevice: Using connection: com.android.tradefed.device.connection.DefaultConnection@20d9002a (SKBFX9C72AA)
12-12 15:02:02 I/CommandInterrupter: Interrupt allowed
12-12 15:02:02 D/InvocationExecution: Starting setup for device: 'SKBFX9C72AA'
12-12 15:02:02 D/InvocationExecution: starting preparer 'com.android.compatibility.common.tradefed.targetprep.VtsDeviceInfoCollector@23ad5bac' on device: 'SKBFX9C72AA'
12-12 15:02:02 I/NativeDeviceStateMonitor: Device SKBFX9C72AA is already ONLINE
12-12 15:02:02 I/NativeDeviceStateMonitor: Waiting 360000 ms for device SKBFX9C72AA boot complete
12-12 15:02:02 I/DeviceStateMonitor: Waiting 359936 ms for device SKBFX9C72AA package manager
12-12 15:02:02 I/NativeDeviceStateMonitor: Waiting 359874 ms for device SKBFX9C72AA external store
12-12 15:02:02 D/RunUtil: Running command [adb, -s, SKBFX9C72AA, shell, getprop, ro.product.vendor.manufacturer] with timeout: 45s
12-12 15:02:02 D/RunUtil: Running command [adb, -s, SKBFX9C72AA, shell, getprop, ro.product.first_api_level] with timeout: 45s
12-12 15:02:02 D/NativeDevice: Using property ro.product.vendor.manufacturer=Foxconn from cache.
12-12 15:02:02 D/RunUtil: Running command [adb, -s, SKBFX9C72AA, shell, getprop, ro.product.cpu.abilist32] with timeout: 45s
12-12 15:02:02 D/RunUtil: Running command [adb, -s, SKBFX9C72AA, shell, getprop, ro.build.reference.fingerprint] with timeout: 45s
12-12 15:02:02 D/RunUtil: Running command [adb, -s, SKBFX9C72AA, shell, getprop, ro.product.name] with timeout: 45s
12-12 15:02:02 D/RunUtil: Running command [adb, -s, SKBFX9C72AA, shell, getprop, ro.build.tags] with timeout: 45s
12-12 15:02:02 D/RunUtil: Running command [adb, -s, SKBFX9C72AA, shell, getprop, ro.product.brand] with timeout: 45s
12-12 15:02:02 D/RunUtil: Running command [adb, -s, SKBFX9C72AA, shell, getprop, ro.build.fingerprint] with timeout: 45s
12-12 15:02:02 D/RunUtil: Running command [adb, -s, SKBFX9C72AA, shell, getprop, ro.product.vendor.model] with timeout: 45s
12-12 15:02:02 D/RunUtil: Running command [adb, -s, SKBFX9C72AA, shell, getprop, ro.product.device] with timeout: 45s
12-12 15:02:03 D/RunUtil: Running command [adb, -s, SKBFX9C72AA, shell, getprop, ro.build.id] with timeout: 45s
12-12 15:02:03 D/RunUtil: Running command [adb, -s, SKBFX9C72AA, shell, getprop, ro.bootimage.build.fingerprint] with timeout: 45s
12-12 15:02:03 D/NativeDevice: Using property ro.build.version.sdk=31 from cache.
12-12 15:02:03 D/NativeDevice: Using property ro.build.fingerprint=Android/gsi_tv_arm/generic:12/STT4.250927.001/14178686:userdebug/test-keys from cache.
12-12 15:02:03 D/NativeDevice: Using property ro.product.vendor.model=BFX-AT100 from cache.
12-12 15:02:03 D/RunUtil: Running command [adb, -s, SKBFX9C72AA, shell, getprop, ro.serialno] with timeout: 45s
12-12 15:02:03 D/RunUtil: Running command [adb, -s, SKBFX9C72AA, shell, getprop, ro.build.version.security_patch] with timeout: 45s
12-12 15:02:03 D/RunUtil: Running command [adb, -s, SKBFX9C72AA, shell, getprop, ro.product.cpu.abi] with timeout: 45s
12-12 15:02:03 D/RunUtil: Running command [adb, -s, SKBFX9C72AA, shell, getprop, ro.product.cpu.abilist64] with timeout: 45s
12-12 15:02:03 D/RunUtil: Running command [adb, -s, SKBFX9C72AA, shell, getprop, ro.build.version.base_os] with timeout: 45s
12-12 15:02:03 D/RunUtil: Running command [adb, -s, SKBFX9C72AA, shell, getprop, ro.vendor.build.fingerprint] with timeout: 45s
12-12 15:02:03 D/RunUtil: Running command [adb, -s, SKBFX9C72AA, shell, getprop, ro.product.board] with timeout: 45s
12-12 15:02:03 D/RunUtil: Running command [adb, -s, SKBFX9C72AA, shell, getprop, ro.build.type] with timeout: 45s
12-12 15:02:03 D/RunUtil: Running command [adb, -s, SKBFX9C72AA, shell, getprop, ro.product.cpu.abilist] with timeout: 45s
12-12 15:02:03 D/RunUtil: Running command [adb, -s, SKBFX9C72AA, shell, getprop, ro.build.version.release] with timeout: 45s
12-12 15:02:03 D/RunUtil: Running command [adb, -s, SKBFX9C72AA, shell, getprop, ro.product.cpu.abi2] with timeout: 45s
12-12 15:02:03 D/RunUtil: Running command [adb, -s, SKBFX9C72AA, shell, getprop, ro.odm.build.fingerprint] with timeout: 45s
12-12 15:02:03 D/RunUtil: Running command [adb, -s, SKBFX9C72AA, shell, getprop, ro.odm.build.version.incremental] with timeout: 45s
12-12 15:02:03 D/RunUtil: Running command [adb, -s, SKBFX9C72AA, shell, getprop, ro.product.odm.device] with timeout: 45s
12-12 15:02:03 D/RunUtil: Running command [adb, -s, SKBFX9C72AA, shell, getprop, ro.boot.product.hardware.sku] with timeout: 45s
12-12 15:02:03 D/InvocationExecution: done with preparer 'com.android.compatibility.common.tradefed.targetprep.VtsDeviceInfoCollector@23ad5bac' on device: 'SKBFX9C72AA' in 1s
12-12 15:02:03 D/InvocationExecution: starting preparer 'com.android.compatibility.common.tradefed.targetprep.DeviceFileCollector@3861a1f9' on device: 'SKBFX9C72AA'
12-12 15:02:03 D/RunUtil: Running command [adb, -s, SKBFX9C72AA, shell, getprop, ro.treble.enabled] with timeout: 45s
12-12 15:02:03 D/NativeDevice: Using 'ls' to check doesFileExist(/sys/fs/selinux/policy)
12-12 15:02:03 D/RunUtil: Running command [adb, -s, SKBFX9C72AA, shell, ls, '/sys/fs/selinux/policy'] with timeout: 2m 0s
12-12 15:02:03 D/InvocationExecution: done with preparer 'com.android.compatibility.common.tradefed.targetprep.DeviceFileCollector@3861a1f9' on device: 'SKBFX9C72AA' in 200 ms
12-12 15:02:03 D/InvocationExecution: starting preparer 'com.android.compatibility.common.tradefed.targetprep.DeviceFileCollector@7ef1cade' on device: 'SKBFX9C72AA'
12-12 15:02:03 D/NativeDevice: Using property ro.treble.enabled=true from cache.
12-12 15:02:03 D/NativeDevice: Using 'ls' to check doesFileExist(/proc/config.gz)
12-12 15:02:03 D/RunUtil: Running command [adb, -s, SKBFX9C72AA, shell, ls, '/proc/config.gz'] with timeout: 2m 0s
12-12 15:02:04 D/InvocationExecution: done with preparer 'com.android.compatibility.common.tradefed.targetprep.DeviceFileCollector@7ef1cade' on device: 'SKBFX9C72AA' in 100 ms
12-12 15:02:04 D/InvocationExecution: starting preparer 'com.android.compatibility.common.tradefed.targetprep.DynamicConfigPusher@4d3d1850' on device: 'SKBFX9C72AA'
12-12 15:02:04 I/UrlReplacement: UrlReplacement file [/home/dev2-google03/android-cts/android-cts-12_r16-linux_x86-arm/android-cts/tools/UrlReplacement.xml] does not exist
12-12 15:02:04 D/InvocationExecution: done with preparer 'com.android.compatibility.common.tradefed.targetprep.DynamicConfigPusher@4d3d1850' on device: 'SKBFX9C72AA' in 565 ms
12-12 15:02:04 D/InvocationExecution: starting preparer 'com.android.compatibility.common.tradefed.targetprep.StayAwakePreparer@48311a00' on device: 'SKBFX9C72AA'
12-12 15:02:04 D/InvocationExecution: done with preparer 'com.android.compatibility.common.tradefed.targetprep.StayAwakePreparer@48311a00' on device: 'SKBFX9C72AA' in 118 ms
12-12 15:02:04 D/InvocationExecution: starting preparer 'com.android.compatibility.common.tradefed.targetprep.PackageDisabler@6300cd28' on device: 'SKBFX9C72AA'
12-12 15:02:04 D/InvocationExecution: done with preparer 'com.android.compatibility.common.tradefed.targetprep.PackageDisabler@6300cd28' on device: 'SKBFX9C72AA' in 96 ms
12-12 15:02:04 D/InvocationExecution: starting preparer 'com.android.compatibility.common.tradefed.targetprep.SettingsPreparer@5990379d' on device: 'SKBFX9C72AA'
12-12 15:02:04 D/SettingsPreparer: Setting verifier_verify_adb_installs to value 0
12-12 15:02:04 D/InvocationExecution: done with preparer 'com.android.compatibility.common.tradefed.targetprep.SettingsPreparer@5990379d' on device: 'SKBFX9C72AA' in 63 ms
12-12 15:02:04 D/InvocationExecution: starting preparer 'com.android.compatibility.common.tradefed.targetprep.SettingsPreparer@66c11ac7' on device: 'SKBFX9C72AA'
12-12 15:02:04 D/SettingsPreparer: Setting hide_error_dialogs to value 1
12-12 15:02:04 D/InvocationExecution: done with preparer 'com.android.compatibility.common.tradefed.targetprep.SettingsPreparer@66c11ac7' on device: 'SKBFX9C72AA' in 64 ms
12-12 15:02:04 D/InvocationExecution: starting preparer 'com.android.compatibility.common.tradefed.targetprep.ApkPreconditionCheck@2c47ba81' on device: 'SKBFX9C72AA'
12-12 15:02:04 D/SearchArtifactUtil: Searching for file CtsPreconditions.apk. Search directories: [/tmp/xts-root-dir-31f7ed76-90d3-4c87-9d46-ebc367af050b/android-cts/testcases, /tmp/tf-workfolder1838493919733649928]
12-12 15:02:05 D/SearchArtifactUtil: Found file /tmp/xts-root-dir-31f7ed76-90d3-4c87-9d46-ebc367af050b/android-cts/testcases/CtsPreconditions.apk in search directory /tmp/xts-root-dir-31f7ed76-90d3-4c87-9d46-ebc367af050b/android-cts/testcases.
12-12 15:02:05 I/NativeDeviceStateMonitor: Device SKBFX9C72AA is already ONLINE
12-12 15:02:05 I/NativeDeviceStateMonitor: Waiting 359999 ms for device SKBFX9C72AA boot complete
12-12 15:02:05 I/DeviceStateMonitor: Waiting 359937 ms for device SKBFX9C72AA package manager
12-12 15:02:05 I/NativeDeviceStateMonitor: Waiting 359875 ms for device SKBFX9C72AA external store
12-12 15:02:05 I/ApkInstrumentationPreparer: Instrumenting package: com.android.preconditions.cts
12-12 15:02:05 D/NativeDevice: Using property ro.build.version.sdk=31 from cache.
12-12 15:02:05 D/RunUtil: Running command [adb, -s, SKBFX9C72AA, shell, getprop, ro.build.version.codename] with timeout: 45s
12-12 15:02:05 D/NativeDevice: Using property ro.build.version.sdk=31 from cache.
12-12 15:02:05 D/NativeDevice: Using property ro.build.version.codename=REL from cache.
12-12 15:02:05 D/AndroidJUnitTest: Disabled test storage as it's not supported on that branch.
12-12 15:02:05 D/NativeDevice: Using property ro.build.version.sdk=31 from cache.
12-12 15:02:05 D/NativeDevice: Using property ro.build.version.codename=REL from cache.
12-12 15:02:05 D/NativeDevice: Using property ro.build.version.sdk=31 from cache.
12-12 15:02:05 D/CtsPreconditions.apk: Uploading CtsPreconditions.apk onto device 'SKBFX9C72AA'
12-12 15:02:05 D/DeviceImpl: Uploading file onto device 'SKBFX9C72AA'
12-12 15:02:06 D/RunUtil: Running command [aapt, dump, badging, /tmp/xts-root-dir-31f7ed76-90d3-4c87-9d46-ebc367af050b/android-cts/testcases/CtsPreconditions.apk] with timeout: 1m 0s
12-12 15:02:06 D/RunUtil: Running command [aapt, dump, xmltree, /tmp/xts-root-dir-31f7ed76-90d3-4c87-9d46-ebc367af050b/android-cts/testcases/CtsPreconditions.apk, AndroidManifest.xml] with timeout: 1m 0s
12-12 15:02:06 D/RunUtil: Running command [adb, -s, SKBFX9C72AA, shell, appops, write-settings] with timeout: 2m 0s
12-12 15:02:06 D/ListInstrumentationParser: instrumentation:com.android.preconditions.cts/androidx.test.runner.AndroidJUnitRunner (target=com.android.preconditions.cts)
12-12 15:02:06 D/ListInstrumentationParser: 
12-12 15:02:06 I/InstrumentationTest: No runner name specified. Using: androidx.test.runner.AndroidJUnitRunner.
12-12 15:02:06 D/NativeDevice: Using property ro.build.version.sdk=31 from cache.
12-12 15:02:06 D/NativeDevice: Using property ro.build.version.sdk=31 from cache.
12-12 15:02:06 D/NativeDevice: Using property ro.build.version.codename=REL from cache.
12-12 15:02:06 D/InstrumentationTest: Initializing com.android.tradefed.device.metric.CountTestCasesCollector for instrumentation.
12-12 15:02:06 I/RemoteAndroidTestRunner: Running am instrument -w -r --no-isolated-storage  -e newRunListenerMode true -e timeout_msec 300000 com.android.preconditions.cts/androidx.test.runner.AndroidJUnitRunner on unknown-tv_gsi_on_arm-SKBFX9C72AA
12-12 15:02:08 D/TestDevice: Uninstalling com.android.preconditions.cts with extra args 
12-12 15:02:09 D/ApkInstrumentationPreparer: Target preparation successful
12-12 15:02:09 D/InvocationExecution: done with preparer 'com.android.compatibility.common.tradefed.targetprep.ApkPreconditionCheck@2c47ba81' on device: 'SKBFX9C72AA' in 4s
12-12 15:02:09 D/InvocationExecution: starting preparer 'com.android.compatibility.common.tradefed.targetprep.WifiCheck@10872a8d' on device: 'SKBFX9C72AA'
12-12 15:02:09 I/NativeDevice: "enable-root" set to false; ignoring 'adb root' request
12-12 15:02:09 I/NativeDeviceStateMonitor: Device SKBFX9C72AA is already ONLINE
12-12 15:02:09 I/NativeDeviceStateMonitor: Waiting 359999 ms for device SKBFX9C72AA boot complete
12-12 15:02:09 I/DeviceStateMonitor: Waiting 359961 ms for device SKBFX9C72AA package manager
12-12 15:02:09 I/NativeDeviceStateMonitor: Waiting 359899 ms for device SKBFX9C72AA external store
12-12 15:02:09 D/NativeDevice: Using property ro.build.version.sdk=31 from cache.
12-12 15:02:09 D/NativeDevice: Using property ro.build.version.codename=REL from cache.
12-12 15:02:09 D/NativeDevice: Using property ro.build.version.sdk=31 from cache.
12-12 15:02:09 D/WifiUtil.apk16667113107147211652.apk: Uploading WifiUtil.apk16667113107147211652.apk onto device 'SKBFX9C72AA'
12-12 15:02:09 D/DeviceImpl: Uploading file onto device 'SKBFX9C72AA'
12-12 15:02:10 D/RunUtil: Running command [aapt, dump, badging, /tmp/WifiUtil.apk16667113107147211652.apk] with timeout: 1m 0s
12-12 15:02:10 D/RunUtil: Running command [aapt, dump, xmltree, /tmp/WifiUtil.apk16667113107147211652.apk, AndroidManifest.xml] with timeout: 1m 0s
12-12 15:02:10 D/RunUtil: Running command [adb, -s, SKBFX9C72AA, shell, appops, write-settings] with timeout: 2m 0s
12-12 15:02:12 I/WifiCheck: Wifi is connected
12-12 15:02:12 D/InvocationExecution: done with preparer 'com.android.compatibility.common.tradefed.targetprep.WifiCheck@10872a8d' on device: 'SKBFX9C72AA' in 2s
12-12 15:02:12 D/InvocationExecution: starting preparer 'com.android.tradefed.targetprep.RunCommandTargetPreparer@8d1bafc' on device: 'SKBFX9C72AA'
12-12 15:02:12 D/RunUtil: Running command [adb, -s, SKBFX9C72AA, shell, rm, -rf, /sdcard/device-info-files] with timeout: 2m 0s
12-12 15:02:12 D/RunUtil: Running command [adb, -s, SKBFX9C72AA, shell, rm, -rf, /sdcard/report-log-files] with timeout: 2m 0s
12-12 15:02:12 D/RunUtil: Running command [adb, -s, SKBFX9C72AA, shell, locksettings, set-disabled, true] with timeout: 2m 0s
12-12 15:02:13 D/InvocationExecution: done with preparer 'com.android.tradefed.targetprep.RunCommandTargetPreparer@8d1bafc' on device: 'SKBFX9C72AA' in 1s
12-12 15:02:13 D/InvocationExecution: starting preparer 'com.android.compatibility.common.tradefed.targetprep.DeviceInfoCollector@781926f4' on device: 'SKBFX9C72AA'
12-12 15:02:13 D/RunUtil: Running command [adb, -s, SKBFX9C72AA, shell, getprop, ro.product.model] with timeout: 45s
12-12 15:02:13 D/NativeDevice: Using property ro.product.device=generic from cache.
12-12 15:02:13 D/NativeDevice: Using property ro.build.id=STT4.250927.001 from cache.
12-12 15:02:13 D/RunUtil: Running command [adb, -s, SKBFX9C72AA, shell, getprop, ro.bootimage.build.fingerprint] with timeout: 45s
12-12 15:02:13 D/NativeDevice: Using property ro.build.version.sdk=31 from cache.
12-12 15:02:13 D/RunUtil: Running command [adb, -s, SKBFX9C72AA, shell, getprop, ro.product.manufacturer] with timeout: 45s
12-12 15:02:13 D/NativeDevice: Using property ro.serialno=SKBFX9C72AA from cache.
12-12 15:02:13 D/NativeDevice: Using property ro.build.version.security_patch=2025-10-01 from cache.
12-12 15:02:13 D/NativeDevice: Using property ro.product.cpu.abilist32=armeabi-v7a,armeabi from cache.
12-12 15:02:13 D/RunUtil: Running command [adb, -s, SKBFX9C72AA, shell, getprop, ro.build.reference.fingerprint] with timeout: 45s
12-12 15:02:13 D/NativeDevice: Using property ro.product.cpu.abi=armeabi-v7a from cache.
12-12 15:02:13 D/RunUtil: Running command [adb, -s, SKBFX9C72AA, shell, getprop, ro.product.cpu.abilist64] with timeout: 45s
12-12 15:02:14 D/NativeDevice: Using property ro.product.name=gsi_tv_arm from cache.
12-12 15:02:14 D/NativeDevice: Using property ro.build.tags=test-keys from cache.
12-12 15:02:14 D/RunUtil: Running command [adb, -s, SKBFX9C72AA, shell, getprop, ro.build.version.incremental] with timeout: 45s
12-12 15:02:14 D/NativeDevice: Using property ro.product.brand=Android from cache.
12-12 15:02:14 D/NativeDevice: Using property ro.build.fingerprint=Android/gsi_tv_arm/generic:12/STT4.250927.001/14178686:userdebug/test-keys from cache.
12-12 15:02:14 D/NativeDevice: Using property ro.vendor.build.fingerprint=SKB/BFX_AT100/BFX-AT100:12/STTC.220724.001/15.552.40-20251209:user/release-keys from cache.
12-12 15:02:14 D/RunUtil: Running command [adb, -s, SKBFX9C72AA, shell, getprop, ro.build.version.base_os] with timeout: 45s
12-12 15:02:14 D/NativeDevice: Using property ro.product.cpu.abilist=armeabi-v7a,armeabi from cache.
12-12 15:02:14 D/NativeDevice: Using property ro.product.board=BFX-AT100 from cache.
12-12 15:02:14 D/NativeDevice: Using property ro.build.type=userdebug from cache.
12-12 15:02:14 D/NativeDevice: Using property ro.build.version.release=12 from cache.
12-12 15:02:14 D/NativeDevice: Using property ro.product.cpu.abi2=armeabi from cache.
12-12 15:02:14 D/SearchArtifactUtil: Searching for file CtsDeviceInfo.apk. Search directories: [/tmp/xts-root-dir-31f7ed76-90d3-4c87-9d46-ebc367af050b/android-cts/testcases, /tmp/tf-workfolder1838493919733649928]
12-12 15:02:14 D/SearchArtifactUtil: Found file /tmp/xts-root-dir-31f7ed76-90d3-4c87-9d46-ebc367af050b/android-cts/testcases/CtsDeviceInfo.apk in search directory /tmp/xts-root-dir-31f7ed76-90d3-4c87-9d46-ebc367af050b/android-cts/testcases.
12-12 15:02:14 I/NativeDeviceStateMonitor: Device SKBFX9C72AA is already ONLINE
12-12 15:02:14 I/NativeDeviceStateMonitor: Waiting 360000 ms for device SKBFX9C72AA boot complete
12-12 15:02:14 I/DeviceStateMonitor: Waiting 359963 ms for device SKBFX9C72AA package manager
12-12 15:02:14 I/NativeDeviceStateMonitor: Waiting 359902 ms for device SKBFX9C72AA external store
12-12 15:02:14 I/ApkInstrumentationPreparer: Instrumenting package: com.android.compatibility.common.deviceinfo
12-12 15:02:14 D/NativeDevice: Using property ro.build.version.sdk=31 from cache.
12-12 15:02:14 D/NativeDevice: Using property ro.build.version.codename=REL from cache.
12-12 15:02:14 D/NativeDevice: Using property ro.build.version.sdk=31 from cache.
12-12 15:02:14 D/NativeDevice: Using property ro.build.version.codename=REL from cache.
12-12 15:02:14 D/AndroidJUnitTest: Disabled test storage as it's not supported on that branch.
12-12 15:02:14 D/NativeDevice: Using property ro.build.version.sdk=31 from cache.
12-12 15:02:14 D/NativeDevice: Using property ro.build.version.codename=REL from cache.
12-12 15:02:14 D/NativeDevice: Using property ro.build.version.sdk=31 from cache.
12-12 15:02:14 D/CtsDeviceInfo.apk: Uploading CtsDeviceInfo.apk onto device 'SKBFX9C72AA'
12-12 15:02:14 D/DeviceImpl: Uploading file onto device 'SKBFX9C72AA'
12-12 15:02:16 D/RunUtil: Running command [aapt, dump, badging, /tmp/xts-root-dir-31f7ed76-90d3-4c87-9d46-ebc367af050b/android-cts/testcases/CtsDeviceInfo.apk] with timeout: 1m 0s
12-12 15:02:16 D/RunUtil: Running command [aapt, dump, xmltree, /tmp/xts-root-dir-31f7ed76-90d3-4c87-9d46-ebc367af050b/android-cts/testcases/CtsDeviceInfo.apk, AndroidManifest.xml] with timeout: 1m 0s
12-12 15:02:16 D/RunUtil: Running command [adb, -s, SKBFX9C72AA, shell, appops, write-settings] with timeout: 2m 0s
12-12 15:02:16 D/ListInstrumentationParser: instrumentation:com.android.compatibility.common.deviceinfo/androidx.test.runner.AndroidJUnitRunner (target=com.android.compatibility.common.deviceinfo)
12-12 15:02:16 D/ListInstrumentationParser: instrumentation:com.android.tradefed.utils.wifi/.WifiUtil (target=com.android.tradefed.utils.wifi)
12-12 15:02:16 D/ListInstrumentationParser: 
12-12 15:02:16 I/InstrumentationTest: No runner name specified. Using: androidx.test.runner.AndroidJUnitRunner.
12-12 15:02:16 D/NativeDevice: Using property ro.build.version.sdk=31 from cache.
12-12 15:02:16 D/NativeDevice: Using property ro.build.version.sdk=31 from cache.
12-12 15:02:16 D/NativeDevice: Using property ro.build.version.codename=REL from cache.
12-12 15:02:16 D/InstrumentationTest: Initializing com.android.tradefed.device.metric.CountTestCasesCollector for instrumentation.
12-12 15:02:16 I/RemoteAndroidTestRunner: Running am instrument -w -r --no-isolated-storage  -e newRunListenerMode true -e timeout_msec 300000 com.android.compatibility.common.deviceinfo/androidx.test.runner.AndroidJUnitRunner on unknown-tv_gsi_on_arm-SKBFX9C72AA
12-12 15:02:27 D/TestDevice: Uninstalling com.android.compatibility.common.deviceinfo with extra args 
12-12 15:02:28 D/ApkInstrumentationPreparer: Target preparation successful
12-12 15:02:28 D/NativeDevice: Using property ro.build.version.sdk=31 from cache.
12-12 15:02:28 D/NativeDevice: Using 'ls' to check doesFileExist(/storage/emulated/0/device-info-files/)
12-12 15:02:28 D/RunUtil: Running command [adb, -s, SKBFX9C72AA, shell, ls, '/storage/emulated/0/device-info-files/'] with timeout: 2m 0s
12-12 15:02:29 D/FileUtil: Creating temp file at /tmp/13441469/cts/inv_14577056596028725407/inv_2914749876990745416 with prefix "UserDeviceInfo.deviceinfo.json_" suffix ".txt.gz"
12-12 15:02:29 I/LogFileSaver: Saved gzip log file /tmp/13441469/cts/inv_14577056596028725407/inv_2914749876990745416/UserDeviceInfo.deviceinfo.json_3989894958061975851.txt.gz. [size=10, elapsed=3ms]
12-12 15:02:29 D/FileUtil: Creating temp file at /tmp/xts-root-dir-31f7ed76-90d3-4c87-9d46-ebc367af050b/android-cts/logs/2025.12.12_15.02.01/inv_8470258709435509936 with prefix "device_compatibility_matrix.xml_" suffix ".txt.gz"
12-12 15:02:29 I/LogFileSaver: Saved gzip log file /tmp/xts-root-dir-31f7ed76-90d3-4c87-9d46-ebc367af050b/android-cts/logs/2025.12.12_15.02.01/inv_8470258709435509936/device_compatibility_matrix.xml_535175194187801836.txt.gz. [size=10, elapsed=1ms]
12-12 15:02:29 D/CertificationSuiteResultReporter: Saved logs for device_compatibility_matrix.xml in /tmp/xts-root-dir-31f7ed76-90d3-4c87-9d46-ebc367af050b/android-cts/logs/2025.12.12_15.02.01/inv_8470258709435509936/device_compatibility_matrix.xml_535175194187801836.txt.gz
12-12 15:02:29 D/FileUtil: Creating temp file at /tmp/13441469/cts/inv_14577056596028725407/inv_2914749876990745416 with prefix "device_compatibility_matrix.xml_" suffix ".txt.gz"
12-12 15:02:29 I/LogFileSaver: Saved gzip log file /tmp/13441469/cts/inv_14577056596028725407/inv_2914749876990745416/device_compatibility_matrix.xml_16374261436523888837.txt.gz. [size=10, elapsed=0ms]
12-12 15:02:29 D/FileUtil: Creating temp file at /tmp/13441469/cts/inv_14577056596028725407/inv_2914749876990745416 with prefix "ConfigurationDeviceInfo.deviceinfo.json_" suffix ".txt.gz"
12-12 15:02:29 I/LogFileSaver: Saved gzip log file /tmp/13441469/cts/inv_14577056596028725407/inv_2914749876990745416/ConfigurationDeviceInfo.deviceinfo.json_8384435716011222982.txt.gz. [size=10, elapsed=0ms]
12-12 15:02:29 D/FileUtil: Creating temp file at /tmp/13441469/cts/inv_14577056596028725407/inv_2914749876990745416 with prefix "MemoryDeviceInfo.deviceinfo.json_" suffix ".txt.gz"
12-12 15:02:29 I/LogFileSaver: Saved gzip log file /tmp/13441469/cts/inv_14577056596028725407/inv_2914749876990745416/MemoryDeviceInfo.deviceinfo.json_12102820825040301597.txt.gz. [size=10, elapsed=1ms]
12-12 15:02:29 D/FileUtil: Creating temp file at /tmp/13441469/cts/inv_14577056596028725407/inv_2914749876990745416 with prefix "CpuDeviceInfo.deviceinfo.json_" suffix ".txt.gz"
12-12 15:02:29 I/LogFileSaver: Saved gzip log file /tmp/13441469/cts/inv_14577056596028725407/inv_2914749876990745416/CpuDeviceInfo.deviceinfo.json_11218873046839225117.txt.gz. [size=10, elapsed=1ms]
12-12 15:02:29 D/FileUtil: Creating temp file at /tmp/13441469/cts/inv_14577056596028725407/inv_2914749876990745416 with prefix "MediaDeviceInfo.deviceinfo.json_" suffix ".txt.gz"
12-12 15:02:29 I/LogFileSaver: Saved gzip log file /tmp/13441469/cts/inv_14577056596028725407/inv_2914749876990745416/MediaDeviceInfo.deviceinfo.json_14055337815987623398.txt.gz. [size=10, elapsed=0ms]
12-12 15:02:29 D/FileUtil: Creating temp file at /tmp/13441469/cts/inv_14577056596028725407/inv_2914749876990745416 with prefix "VintfDeviceInfo.deviceinfo.json_" suffix ".txt.gz"
12-12 15:02:29 I/LogFileSaver: Saved gzip log file /tmp/13441469/cts/inv_14577056596028725407/inv_2914749876990745416/VintfDeviceInfo.deviceinfo.json_17610013568461224913.txt.gz. [size=10, elapsed=1ms]
12-12 15:02:29 D/FileUtil: Creating temp file at /tmp/13441469/cts/inv_14577056596028725407/inv_2914749876990745416 with prefix "GraphicsDeviceInfo.deviceinfo.json_" suffix ".txt.gz"
12-12 15:02:29 I/LogFileSaver: Saved gzip log file /tmp/13441469/cts/inv_14577056596028725407/inv_2914749876990745416/GraphicsDeviceInfo.deviceinfo.json_9157133859998615538.txt.gz. [size=10, elapsed=1ms]
12-12 15:02:29 D/FileUtil: Creating temp file at /tmp/13441469/cts/inv_14577056596028725407/inv_2914749876990745416 with prefix "AppStandbyDeviceInfo.deviceinfo.json_" suffix ".txt.gz"
12-12 15:02:29 I/LogFileSaver: Saved gzip log file /tmp/13441469/cts/inv_14577056596028725407/inv_2914749876990745416/AppStandbyDeviceInfo.deviceinfo.json_7532514273522455834.txt.gz. [size=10, elapsed=0ms]
12-12 15:02:29 D/FileUtil: Creating temp file at /tmp/13441469/cts/inv_14577056596028725407/inv_2914749876990745416 with prefix "MediaDrmDeviceInfo.deviceinfo.json_" suffix ".txt.gz"
12-12 15:02:29 I/LogFileSaver: Saved gzip log file /tmp/13441469/cts/inv_14577056596028725407/inv_2914749876990745416/MediaDrmDeviceInfo.deviceinfo.json_574991368849110083.txt.gz. [size=10, elapsed=1ms]
12-12 15:02:29 D/FileUtil: Creating temp file at /tmp/xts-root-dir-31f7ed76-90d3-4c87-9d46-ebc367af050b/android-cts/logs/2025.12.12_15.02.01/inv_8470258709435509936 with prefix "framework_compatibility_matrix.xml_" suffix ".txt.gz"
12-12 15:02:29 I/LogFileSaver: Saved gzip log file /tmp/xts-root-dir-31f7ed76-90d3-4c87-9d46-ebc367af050b/android-cts/logs/2025.12.12_15.02.01/inv_8470258709435509936/framework_compatibility_matrix.xml_6385951447531209655.txt.gz. [size=10, elapsed=7ms]
12-12 15:02:29 D/CertificationSuiteResultReporter: Saved logs for framework_compatibility_matrix.xml in /tmp/xts-root-dir-31f7ed76-90d3-4c87-9d46-ebc367af050b/android-cts/logs/2025.12.12_15.02.01/inv_8470258709435509936/framework_compatibility_matrix.xml_6385951447531209655.txt.gz
12-12 15:02:29 D/FileUtil: Creating temp file at /tmp/13441469/cts/inv_14577056596028725407/inv_2914749876990745416 with prefix "framework_compatibility_matrix.xml_" suffix ".txt.gz"
12-12 15:02:29 I/LogFileSaver: Saved gzip log file /tmp/13441469/cts/inv_14577056596028725407/inv_2914749876990745416/framework_compatibility_matrix.xml_8818110821878576596.txt.gz. [size=10, elapsed=7ms]
12-12 15:02:29 D/FileUtil: Creating temp file at /tmp/13441469/cts/inv_14577056596028725407/inv_2914749876990745416 with prefix "VulkanDeviceInfo.deviceinfo.json_" suffix ".txt.gz"
12-12 15:02:29 I/LogFileSaver: Saved gzip log file /tmp/13441469/cts/inv_14577056596028725407/inv_2914749876990745416/VulkanDeviceInfo.deviceinfo.json_8066290805808902227.txt.gz. [size=10, elapsed=0ms]
12-12 15:02:29 D/FileUtil: Creating temp file at /tmp/13441469/cts/inv_14577056596028725407/inv_2914749876990745416 with prefix "CameraDeviceInfo.deviceinfo.json_" suffix ".txt.gz"
12-12 15:02:29 I/LogFileSaver: Saved gzip log file /tmp/13441469/cts/inv_14577056596028725407/inv_2914749876990745416/CameraDeviceInfo.deviceinfo.json_12958711122344189928.txt.gz. [size=10, elapsed=0ms]
12-12 15:02:29 D/FileUtil: Creating temp file at /tmp/13441469/cts/inv_14577056596028725407/inv_2914749876990745416 with prefix "GenericDeviceInfo.deviceinfo.json_" suffix ".txt.gz"
12-12 15:02:29 I/LogFileSaver: Saved gzip log file /tmp/13441469/cts/inv_14577056596028725407/inv_2914749876990745416/GenericDeviceInfo.deviceinfo.json_2521474511443531238.txt.gz. [size=10, elapsed=1ms]
12-12 15:02:29 D/FileUtil: Creating temp file at /tmp/13441469/cts/inv_14577056596028725407/inv_2914749876990745416 with prefix "FeatureDeviceInfo.deviceinfo.json_" suffix ".txt.gz"
12-12 15:02:29 I/LogFileSaver: Saved gzip log file /tmp/13441469/cts/inv_14577056596028725407/inv_2914749876990745416/FeatureDeviceInfo.deviceinfo.json_3801619220525320592.txt.gz. [size=10, elapsed=1ms]
12-12 15:02:29 D/FileUtil: Creating temp file at /tmp/13441469/cts/inv_14577056596028725407/inv_2914749876990745416 with prefix "PackageDeviceInfo.deviceinfo.json_" suffix ".txt.gz"
12-12 15:02:29 I/LogFileSaver: Saved gzip log file /tmp/13441469/cts/inv_14577056596028725407/inv_2914749876990745416/PackageDeviceInfo.deviceinfo.json_13472056987412695775.txt.gz. [size=10, elapsed=2ms]
12-12 15:02:29 D/FileUtil: Creating temp file at /tmp/13441469/cts/inv_14577056596028725407/inv_2914749876990745416 with prefix "LocaleDeviceInfo.deviceinfo.json_" suffix ".txt.gz"
12-12 15:02:29 I/LogFileSaver: Saved gzip log file /tmp/13441469/cts/inv_14577056596028725407/inv_2914749876990745416/LocaleDeviceInfo.deviceinfo.json_9944594194235721055.txt.gz. [size=10, elapsed=0ms]
12-12 15:02:29 D/FileUtil: Creating temp file at /tmp/13441469/cts/inv_14577056596028725407/inv_2914749876990745416 with prefix "StorageDeviceInfo.deviceinfo.json_" suffix ".txt.gz"
12-12 15:02:29 I/LogFileSaver: Saved gzip log file /tmp/13441469/cts/inv_14577056596028725407/inv_2914749876990745416/StorageDeviceInfo.deviceinfo.json_16237231337111389868.txt.gz. [size=10, elapsed=1ms]
12-12 15:02:29 D/FileUtil: Creating temp file at /tmp/13441469/cts/inv_14577056596028725407/inv_2914749876990745416 with prefix "ScreenDeviceInfo.deviceinfo.json_" suffix ".txt.gz"
12-12 15:02:29 I/LogFileSaver: Saved gzip log file /tmp/13441469/cts/inv_14577056596028725407/inv_2914749876990745416/ScreenDeviceInfo.deviceinfo.json_3871249070673966794.txt.gz. [size=10, elapsed=0ms]
12-12 15:02:29 D/FileUtil: Creating temp file at /tmp/xts-root-dir-31f7ed76-90d3-4c87-9d46-ebc367af050b/android-cts/logs/2025.12.12_15.02.01/inv_8470258709435509936 with prefix "framework_manifest.xml_" suffix ".txt.gz"
12-12 15:02:29 I/LogFileSaver: Saved gzip log file /tmp/xts-root-dir-31f7ed76-90d3-4c87-9d46-ebc367af050b/android-cts/logs/2025.12.12_15.02.01/inv_8470258709435509936/framework_manifest.xml_7886703658252804631.txt.gz. [size=10, elapsed=0ms]
12-12 15:02:29 D/CertificationSuiteResultReporter: Saved logs for framework_manifest.xml in /tmp/xts-root-dir-31f7ed76-90d3-4c87-9d46-ebc367af050b/android-cts/logs/2025.12.12_15.02.01/inv_8470258709435509936/framework_manifest.xml_7886703658252804631.txt.gz
12-12 15:02:29 D/FileUtil: Creating temp file at /tmp/13441469/cts/inv_14577056596028725407/inv_2914749876990745416 with prefix "framework_manifest.xml_" suffix ".txt.gz"
12-12 15:02:29 I/LogFileSaver: Saved gzip log file /tmp/13441469/cts/inv_14577056596028725407/inv_2914749876990745416/framework_manifest.xml_6112095126898214628.txt.gz. [size=10, elapsed=0ms]
12-12 15:02:29 D/FileUtil: Creating temp file at /tmp/13441469/cts/inv_14577056596028725407/inv_2914749876990745416 with prefix "SensorDeviceInfo.deviceinfo.json_" suffix ".txt.gz"
12-12 15:02:29 I/LogFileSaver: Saved gzip log file /tmp/13441469/cts/inv_14577056596028725407/inv_2914749876990745416/SensorDeviceInfo.deviceinfo.json_6517066450915137059.txt.gz. [size=10, elapsed=0ms]
12-12 15:02:29 D/FileUtil: Creating temp file at /tmp/xts-root-dir-31f7ed76-90d3-4c87-9d46-ebc367af050b/android-cts/logs/2025.12.12_15.02.01/inv_8470258709435509936 with prefix "device_manifest.xml_" suffix ".txt.gz"
12-12 15:02:29 I/LogFileSaver: Saved gzip log file /tmp/xts-root-dir-31f7ed76-90d3-4c87-9d46-ebc367af050b/android-cts/logs/2025.12.12_15.02.01/inv_8470258709435509936/device_manifest.xml_671675000457525680.txt.gz. [size=10, elapsed=0ms]
12-12 15:02:29 D/CertificationSuiteResultReporter: Saved logs for device_manifest.xml in /tmp/xts-root-dir-31f7ed76-90d3-4c87-9d46-ebc367af050b/android-cts/logs/2025.12.12_15.02.01/inv_8470258709435509936/device_manifest.xml_671675000457525680.txt.gz
12-12 15:02:29 D/FileUtil: Creating temp file at /tmp/13441469/cts/inv_14577056596028725407/inv_2914749876990745416 with prefix "device_manifest.xml_" suffix ".txt.gz"
12-12 15:02:29 I/LogFileSaver: Saved gzip log file /tmp/13441469/cts/inv_14577056596028725407/inv_2914749876990745416/device_manifest.xml_12059566136136977946.txt.gz. [size=10, elapsed=0ms]
12-12 15:02:29 D/FileUtil: Creating temp file at /tmp/13441469/cts/inv_14577056596028725407/inv_2914749876990745416 with prefix "ClientIdDeviceInfo.deviceinfo.json_" suffix ".txt.gz"
12-12 15:02:29 I/LogFileSaver: Saved gzip log file /tmp/13441469/cts/inv_14577056596028725407/inv_2914749876990745416/ClientIdDeviceInfo.deviceinfo.json_5225123246682609877.txt.gz. [size=10, elapsed=1ms]
12-12 15:02:29 D/InvocationExecution: done with preparer 'com.android.compatibility.common.tradefed.targetprep.DeviceInfoCollector@781926f4' on device: 'SKBFX9C72AA' in 15s
12-12 15:02:29 D/InvocationExecution: starting preparer 'com.android.compatibility.common.tradefed.targetprep.ReportLogCollector@70b67ebf' on device: 'SKBFX9C72AA'
12-12 15:02:29 D/InvocationExecution: done with preparer 'com.android.compatibility.common.tradefed.targetprep.ReportLogCollector@70b67ebf' on device: 'SKBFX9C72AA' in 1 ms
12-12 15:02:29 D/InvocationExecution: starting preparer 'com.android.tradefed.targetprep.RunCommandTargetPreparer@3a965799' on device: 'SKBFX9C72AA'
12-12 15:02:29 D/RunUtil: Running command [adb, -s, SKBFX9C72AA, shell, settings, put, global, package_verifier_enable, 0] with timeout: 2m 0s
12-12 15:02:29 D/InvocationExecution: done with preparer 'com.android.tradefed.targetprep.RunCommandTargetPreparer@3a965799' on device: 'SKBFX9C72AA' in 103 ms
12-12 15:02:29 D/InvocationExecution: starting preparer 'com.android.tradefed.targetprep.RunCommandTargetPreparer@4183b5d2' on device: 'SKBFX9C72AA'
12-12 15:02:29 D/RunUtil: Running command [adb, -s, SKBFX9C72AA, shell, settings, put, global, verifier_engprod, 1] with timeout: 2m 0s
12-12 15:02:29 D/InvocationExecution: done with preparer 'com.android.tradefed.targetprep.RunCommandTargetPreparer@4183b5d2' on device: 'SKBFX9C72AA' in 67 ms
12-12 15:02:29 D/InvocationExecution: starting preparer 'com.android.compatibility.common.tradefed.targetprep.PropertyCheck@59818d12' on device: 'SKBFX9C72AA'
12-12 15:02:29 D/NativeDevice: Using property ro.build.type=userdebug from cache.
12-12 15:02:29 W/PropertyCheck: Expected "user" but found "userdebug" for property: ro.build.type
12-12 15:02:29 D/InvocationExecution: done with preparer 'com.android.compatibility.common.tradefed.targetprep.PropertyCheck@59818d12' on device: 'SKBFX9C72AA' in 1 ms
12-12 15:02:29 D/InvocationExecution: starting preparer 'com.android.compatibility.common.tradefed.targetprep.PropertyCheck@62e1eb' on device: 'SKBFX9C72AA'
12-12 15:02:29 D/RunUtil: Running command [adb, -s, SKBFX9C72AA, shell, getprop, ro.product.locale] with timeout: 45s
12-12 15:02:29 D/InvocationExecution: done with preparer 'com.android.compatibility.common.tradefed.targetprep.PropertyCheck@62e1eb' on device: 'SKBFX9C72AA' in 44 ms
12-12 15:02:29 D/InvocationExecution: starting preparer 'com.android.compatibility.common.tradefed.targetprep.PropertyCheck@1c232509' on device: 'SKBFX9C72AA'
12-12 15:02:29 D/RunUtil: Running command [adb, -s, SKBFX9C72AA, shell, getprop, persist.sys.test_harness] with timeout: 45s
12-12 15:02:29 W/PropertyCheck: Property "persist.sys.test_harness" not found on device, cannot verify value "false" 
12-12 15:02:29 D/InvocationExecution: done with preparer 'com.android.compatibility.common.tradefed.targetprep.PropertyCheck@1c232509' on device: 'SKBFX9C72AA' in 46 ms
12-12 15:02:29 D/InvocationExecution: Done with setup of device: 'SKBFX9C72AA'
12-12 15:02:29 D/RunUtil: Running command [adb, -s, SKBFX9C72AA, shell, uname, -a] with timeout: 2m 0s
12-12 15:02:29 I/InvocationExecution: Device SKBFX9C72AA kernel information: 'Linux localhost 4.9.269-abk000c-552r40-20251209 #1 SMP PREEMPT Tue Dec 9 16:32:20 KST 2025 armv8l'
12-12 15:02:29 D/RunUtil: Running command [adb, -s, SKBFX9C72AA, shell, getprop, ro.system.build.fingerprint] with timeout: 45s
12-12 15:02:29 I/InvocationExecution: Device SKBFX9C72AA system image build information: 'Android/gsi_tv_arm/generic:12/STT4.250927.001/14178686:userdebug/test-keys'
12-12 15:02:29 D/NativeDevice: Using property ro.vendor.build.fingerprint=SKB/BFX_AT100/BFX-AT100:12/STTC.220724.001/15.552.40-20251209:user/release-keys from cache.
12-12 15:02:29 I/InvocationExecution: Device SKBFX9C72AA vendor image build information: 'SKB/BFX_AT100/BFX-AT100:12/STTC.220724.001/15.552.40-20251209:user/release-keys'
12-12 15:02:29 D/InvocationExecution: Total setup duration: 27s'
12-12 15:02:29 D/LogFileSaver: Log data for device_logcat_setup_SKBFX9C72AA is already compressed, skipping compression
12-12 15:02:29 D/FileUtil: Creating temp file at /tmp/xts-root-dir-31f7ed76-90d3-4c87-9d46-ebc367af050b/android-cts/logs/2025.12.12_15.02.01/inv_8470258709435509936 with prefix "device_logcat_setup_SKBFX9C72AA_" suffix ".txt"
12-12 15:02:29 I/LogFileSaver: Saved log file /tmp/xts-root-dir-31f7ed76-90d3-4c87-9d46-ebc367af050b/android-cts/logs/2025.12.12_15.02.01/inv_8470258709435509936/device_logcat_setup_SKBFX9C72AA_4477943305083242164.txt. [size=1378498, elapsed=5ms]
12-12 15:02:29 D/CertificationSuiteResultReporter: Saved logs for device_logcat_setup_SKBFX9C72AA in /tmp/xts-root-dir-31f7ed76-90d3-4c87-9d46-ebc367af050b/android-cts/logs/2025.12.12_15.02.01/inv_8470258709435509936/device_logcat_setup_SKBFX9C72AA_4477943305083242164.txt
12-12 15:02:29 D/LogFileSaver: Log data for device_logcat_setup_SKBFX9C72AA is already compressed, skipping compression
12-12 15:02:29 D/FileUtil: Creating temp file at /tmp/13441469/cts/inv_14577056596028725407/inv_2914749876990745416 with prefix "device_logcat_setup_SKBFX9C72AA_" suffix ".txt"
12-12 15:02:29 I/LogFileSaver: Saved log file /tmp/13441469/cts/inv_14577056596028725407/inv_2914749876990745416/device_logcat_setup_SKBFX9C72AA_11653299427268612014.txt. [size=1378498, elapsed=6ms]
12-12 15:02:29 D/TestDevice: No snapuserd notification in progress for BLOCK_BEFORE_TEST
12-12 15:02:29 D/PrettyPrintDelimiter: 
===============================
===== TEST PHASE STARTING =====
===============================
12-12 15:02:29 D/RunUtil: Running command [adb, -s, SKBFX9C72AA, shell, cmd, device_state, print-states] with timeout: 2m 0s
12-12 15:02:29 D/NativeDevice: Using property ro.product.cpu.abi=armeabi-v7a from cache.
12-12 15:02:29 D/BaseTestSuite: Initializing ModuleRepo
ABIs:[{armeabi-v7a, bitness=32}]
Test Args:[com.android.tradefed.testtype.AndroidJUnitTest:exclude-annotation:com.android.compatibility.common.util.CtsDownstreamingTest, com.android.compatibility.common.tradefed.testtype.JarHostTest:exclude-annotation:com.android.compatibility.common.util.CtsDownstreamingTest, com.android.tradefed.testtype.HostTest:exclude-annotation:com.android.compatibility.common.util.CtsDownstreamingTest, com.android.tradefed.testtype.AndroidJUnitTest:exclude-annotation:android.platform.test.annotations.AsbSecurityTest, com.android.compatibility.common.tradefed.testtype.JarHostTest:exclude-annotation:android.platform.test.annotations.AsbSecurityTest, com.android.tradefed.testtype.AndroidJUnitTest:exclude-annotation:android.platform.test.annotations.AppModeInstant, com.android.compatibility.common.tradefed.testtype.JarHostTest:exclude-annotation:android.platform.test.annotations.AppModeInstant, com.android.tradefed.testtype.HostTest:exclude-annotation:android.platform.test.annotations.AppModeInstant, com.android.tradefed.testtype.AndroidJUnitTest:exclude-annotation:android.platform.test.annotations.RestrictedBuildTest, com.android.tradefed.testtype.HostTest:exclude-annotation:android.platform.test.annotations.RestrictedBuildTest, com.android.compatibility.common.tradefed.testtype.JarHostTest:exclude-annotation:android.platform.test.annotations.RestrictedBuildTest]
Module Args:[CtsDeqpTestCases:include-filter:dEQP-EGL.*, CtsDeqpTestCases:include-filter:dEQP-GLES2.functional.prerequisite#*, CtsDeqpTestCases:include-filter:dEQP-GLES3.functional.prerequisite#*, CtsDeqpTestCases:include-filter:dEQP-VK.api.smoke#*]
Includes: {armeabi-v7a CtsAppTestCases=[CtsAppTestCases android.app.cts.DownloadManagerTest#testDownloadManagerSupportsHttpsWithExternalWebServer]}
Excludes: {x86 CtsPerfettoTestCases=[x86 CtsPerfettoTestCases PerfettoTest#TestFtraceProducer], arm64-v8a CtsRenderscriptLegacyTestCases=[arm64-v8a CtsRenderscriptLegacyTestCases], x86_64 CtsRenderscriptLegacyTestCases=[x86_64 CtsRenderscriptLegacyTestCases], mips64 CtsRenderscriptLegacyTestCases=[mips64 CtsRenderscriptLegacyTestCases], x86_64 CtsLiblogTestCases=[x86_64 CtsLiblogTestCases liblog#event_log_tags], arm64-v8a CtsMediaBitstreamsTestCases=[arm64-v8a CtsMediaBitstreamsTestCases], x86_64 CtsMediaBitstreamsTestCases=[x86_64 CtsMediaBitstreamsTestCases], mips64 CtsMediaBitstreamsTestCases=[mips64 CtsMediaBitstreamsTestCases], arm64-v8a CtsWrapWrapDebugMallocDebugTestCases=[arm64-v8a CtsWrapWrapDebugMallocDebugTestCases], armeabi-v7a CtsAppTestCases=[CtsAppTestCases android.app.cts.ActivityKeyboardShortcutsTest#testRequestShowKeyboardShortcuts, CtsAppTestCases android.app.cts.ActionBarTest#testOpenOptionsMenu, CtsAppTestCases android.app.cts.SystemFeaturesTest#testLocationFeatures, CtsAppTestCases android.app.cts.ActionBarTest#testOptionsMenuKey]}
12-12 15:02:29 D/BaseTestSuite: Foldable states: [foldable:0:DEFAULT]
12-12 15:02:29 D/BaseTestSuite: Loading tests from [/tmp/xts-root-dir-31f7ed76-90d3-4c87-9d46-ebc367af050b/android-cts/testcases]
12-12 15:02:34 D/ITestSuite: No remote build info, skipping stageTestArtifacts
12-12 15:02:34 D/ITestSuite: Resource not found for allowed preparers: /suite/google-allowed-preparers.txt
12-12 15:02:34 D/ITestSuite: [Total Unique Modules = 1]
12-12 15:02:34 I/ITestSuite: SKBFX9C72AA running 1 modules: [armeabi-v7a CtsAppTestCases]
12-12 15:02:34 D/TradefedFeatureClient: invoking feature 'skipFeature'
12-12 15:02:34 D/TradefedFeatureClient: Using reference id from metrics.
12-12 15:02:34 D/TradefedFeatureClient: name: "skipFeature"
reference_id: "5a8df15c-7f9d-4795-bcd2-ae947a69758e"

12-12 15:02:34 D/TradefedFeatureServer: Executing com.android.tradefed.result.skipped.SkipFeature@5f9a56a5 with [name: "skipFeature"
reference_id: "5a8df15c-7f9d-4795-bcd2-ae947a69758e"
]
12-12 15:02:34 D/TradefedFeatureClient: Feature name: skipFeature. response: multi_part_response {
  response_part {
    key: "delimiter"
    value: "\\+,"
  }
  response_part {
    key: "presubmit"
    value: "false"
  }
  response_part {
    key: "skipModules"
  }
  response_part {
    key: "imageDigests"
  }
}

12-12 15:02:34 D/BaseTestSuite: Filters for 'armeabi-v7a CtsAppTestCases': [CtsAppTestCases android.app.cts.ActivityKeyboardShortcutsTest#testRequestShowKeyboardShortcuts, CtsAppTestCases android.app.cts.ActionBarTest#testOpenOptionsMenu, CtsAppTestCases android.app.cts.SystemFeaturesTest#testLocationFeatures, CtsAppTestCases android.app.cts.ActionBarTest#testOptionsMenuKey]
12-12 15:02:34 D/FileUtil: Creating temp file at /tmp/tf-workfolder1838493919733649928 with prefix "CtsAppTestCases" suffix ".xml"
12-12 15:02:34 D/LogFileSaver: Log data for module-configuration is already compressed, skipping compression
12-12 15:02:34 D/FileUtil: Creating temp file at /tmp/xts-root-dir-31f7ed76-90d3-4c87-9d46-ebc367af050b/android-cts/logs/2025.12.12_15.02.01/inv_8470258709435509936 with prefix "module-configuration_" suffix ".xml"
12-12 15:02:34 I/LogFileSaver: Saved log file /tmp/xts-root-dir-31f7ed76-90d3-4c87-9d46-ebc367af050b/android-cts/logs/2025.12.12_15.02.01/inv_8470258709435509936/module-configuration_4931047983356571023.xml. [size=3337, elapsed=0ms]
12-12 15:02:34 D/CertificationSuiteResultReporter: Saved logs for module-configuration in /tmp/xts-root-dir-31f7ed76-90d3-4c87-9d46-ebc367af050b/android-cts/logs/2025.12.12_15.02.01/inv_8470258709435509936/module-configuration_4931047983356571023.xml
12-12 15:02:34 D/LogFileSaver: Log data for module-configuration is already compressed, skipping compression
12-12 15:02:34 D/FileUtil: Creating temp file at /tmp/13441469/cts/inv_14577056596028725407/inv_2914749876990745416 with prefix "module-configuration_" suffix ".xml"
12-12 15:02:34 I/LogFileSaver: Saved log file /tmp/13441469/cts/inv_14577056596028725407/inv_2914749876990745416/module-configuration_14474440032161712447.xml (type:HARNESS_CONFIG). [size=3337, elapsed=1ms]
12-12 15:02:34 I/ITestSuite: Running system status checker before module execution: armeabi-v7a CtsAppTestCases
12-12 15:02:34 D/NativeDevice: Using property ro.build.version.sdk=31 from cache.
12-12 15:02:34 D/NativeDevice: Using property ro.build.version.sdk=31 from cache.
12-12 15:02:34 D/NativeDevice: Using property ro.build.version.sdk=31 from cache.
12-12 15:02:34 I/UserChecker: Current user 0 is already user type CURRENT, no action.
12-12 15:02:34 D/DeviceSettingChecker: Begin preExecutionCheck for checking device setting
12-12 15:02:34 D/NativeDevice: Using property ro.build.version.sdk=31 from cache.
12-12 15:02:34 D/NativeDevice: Using property ro.build.version.sdk=31 from cache.
12-12 15:02:35 D/NativeDevice: Using property ro.build.type=userdebug from cache.
12-12 15:02:35 I/DeviceBaselineChecker: Enable device baselines  in 1 millis.
12-12 15:02:35 D/ModuleDefinition: Running module armeabi-v7a CtsAppTestCases
12-12 15:02:35 D/ModuleDefinition: Running setup preparer: LocationCheck
12-12 15:02:35 I/LocationCheck: Verifying location setting
12-12 15:02:35 D/ModuleDefinition: Running setup preparer: SuiteApkInstaller
12-12 15:02:35 D/TestAppInstallSetup: Using abi armeabi-v7a from abi option.
12-12 15:02:35 D/NativeDevice: Using property ro.build.version.sdk=31 from cache.
12-12 15:02:35 D/NativeDevice: Using property ro.build.version.sdk=31 from cache.
12-12 15:02:35 D/NativeDevice: Using property ro.build.version.codename=REL from cache.
12-12 15:02:35 D/NativeDevice: Using property ro.build.version.sdk=31 from cache.
12-12 15:02:35 D/RunUtil: Running command [adb, -s, SKBFX9C72AA, shell, pm, list, features] with timeout: 2m 0s
12-12 15:02:35 D/NativeDevice: Using property ro.build.version.sdk=31 from cache.
12-12 15:02:35 D/NativeDevice: Using property ro.build.version.codename=REL from cache.
12-12 15:02:35 D/SearchArtifactUtil: Searching for file CtsSimpleApp.apk. Search directories: [/tmp/xts-root-dir-31f7ed76-90d3-4c87-9d46-ebc367af050b/android-cts/testcases, /tmp/xts-root-dir-31f7ed76-90d3-4c87-9d46-ebc367af050b/android-cts/testcases, /tmp/tf-workfolder1838493919733649928]
12-12 15:02:35 W/SearchArtifactUtil: we have a module name: CtsAppTestCases but no directory found in /tmp/xts-root-dir-31f7ed76-90d3-4c87-9d46-ebc367af050b/android-cts/testcases.
12-12 15:02:35 D/SearchArtifactUtil: Found file /tmp/xts-root-dir-31f7ed76-90d3-4c87-9d46-ebc367af050b/android-cts/testcases/CtsSimpleApp.apk in search directory /tmp/xts-root-dir-31f7ed76-90d3-4c87-9d46-ebc367af050b/android-cts/testcases.
12-12 15:02:35 D/RunUtil: Running command [aapt2, dump, badging, /tmp/xts-root-dir-31f7ed76-90d3-4c87-9d46-ebc367af050b/android-cts/testcases/CtsSimpleApp.apk] with timeout: 1m 0s
12-12 15:02:35 D/RunUtil: Running command [aapt2, dump, xmltree, /tmp/xts-root-dir-31f7ed76-90d3-4c87-9d46-ebc367af050b/android-cts/testcases/CtsSimpleApp.apk, --file, AndroidManifest.xml] with timeout: 1m 0s
12-12 15:02:35 D/TestAppInstallSetup: Installing apk com.android.cts.launcherapps.simpleapp with [/tmp/xts-root-dir-31f7ed76-90d3-4c87-9d46-ebc367af050b/android-cts/testcases/CtsSimpleApp.apk] ...
12-12 15:02:35 D/NativeDevice: Using property ro.build.version.sdk=31 from cache.
12-12 15:02:35 D/CtsSimpleApp.apk: Uploading CtsSimpleApp.apk onto device 'SKBFX9C72AA'
12-12 15:02:35 D/DeviceImpl: Uploading file onto device 'SKBFX9C72AA'
12-12 15:02:35 D/RunUtil: Running command [aapt, dump, badging, /tmp/xts-root-dir-31f7ed76-90d3-4c87-9d46-ebc367af050b/android-cts/testcases/CtsSimpleApp.apk] with timeout: 1m 0s
12-12 15:02:35 D/RunUtil: Running command [aapt, dump, xmltree, /tmp/xts-root-dir-31f7ed76-90d3-4c87-9d46-ebc367af050b/android-cts/testcases/CtsSimpleApp.apk, AndroidManifest.xml] with timeout: 1m 0s
12-12 15:02:35 D/RunUtil: Running command [adb, -s, SKBFX9C72AA, shell, appops, write-settings] with timeout: 2m 0s
12-12 15:02:36 D/SearchArtifactUtil: Searching for file CtsAppTestStubs.apk. Search directories: [/tmp/xts-root-dir-31f7ed76-90d3-4c87-9d46-ebc367af050b/android-cts/testcases, /tmp/xts-root-dir-31f7ed76-90d3-4c87-9d46-ebc367af050b/android-cts/testcases, /tmp/tf-workfolder1838493919733649928]
12-12 15:02:36 W/SearchArtifactUtil: we have a module name: CtsAppTestCases but no directory found in /tmp/xts-root-dir-31f7ed76-90d3-4c87-9d46-ebc367af050b/android-cts/testcases.
12-12 15:02:36 D/SearchArtifactUtil: Found file /tmp/xts-root-dir-31f7ed76-90d3-4c87-9d46-ebc367af050b/android-cts/testcases/CtsAppTestStubs.apk in search directory /tmp/xts-root-dir-31f7ed76-90d3-4c87-9d46-ebc367af050b/android-cts/testcases.
12-12 15:02:36 D/RunUtil: Running command [aapt2, dump, badging, /tmp/xts-root-dir-31f7ed76-90d3-4c87-9d46-ebc367af050b/android-cts/testcases/CtsAppTestStubs.apk] with timeout: 1m 0s
12-12 15:02:36 D/RunUtil: Running command [aapt2, dump, xmltree, /tmp/xts-root-dir-31f7ed76-90d3-4c87-9d46-ebc367af050b/android-cts/testcases/CtsAppTestStubs.apk, --file, AndroidManifest.xml] with timeout: 1m 0s
12-12 15:02:36 D/TestAppInstallSetup: Installing apk android.app.stubs with [/tmp/xts-root-dir-31f7ed76-90d3-4c87-9d46-ebc367af050b/android-cts/testcases/CtsAppTestStubs.apk] ...
12-12 15:02:36 D/NativeDevice: Using property ro.build.version.sdk=31 from cache.
12-12 15:02:36 D/CtsAppTestStubs.apk: Uploading CtsAppTestStubs.apk onto device 'SKBFX9C72AA'
12-12 15:02:36 D/DeviceImpl: Uploading file onto device 'SKBFX9C72AA'
12-12 15:02:38 D/RunUtil: Running command [aapt, dump, badging, /tmp/xts-root-dir-31f7ed76-90d3-4c87-9d46-ebc367af050b/android-cts/testcases/CtsAppTestStubs.apk] with timeout: 1m 0s
12-12 15:02:38 D/RunUtil: Running command [aapt, dump, xmltree, /tmp/xts-root-dir-31f7ed76-90d3-4c87-9d46-ebc367af050b/android-cts/testcases/CtsAppTestStubs.apk, AndroidManifest.xml] with timeout: 1m 0s
12-12 15:02:38 D/RunUtil: Running command [adb, -s, SKBFX9C72AA, shell, appops, write-settings] with timeout: 2m 0s
12-12 15:02:38 D/SearchArtifactUtil: Searching for file CtsAppTestStubsApp1.apk. Search directories: [/tmp/xts-root-dir-31f7ed76-90d3-4c87-9d46-ebc367af050b/android-cts/testcases, /tmp/xts-root-dir-31f7ed76-90d3-4c87-9d46-ebc367af050b/android-cts/testcases, /tmp/tf-workfolder1838493919733649928]
12-12 15:02:38 W/SearchArtifactUtil: we have a module name: CtsAppTestCases but no directory found in /tmp/xts-root-dir-31f7ed76-90d3-4c87-9d46-ebc367af050b/android-cts/testcases.
12-12 15:02:38 D/SearchArtifactUtil: Found file /tmp/xts-root-dir-31f7ed76-90d3-4c87-9d46-ebc367af050b/android-cts/testcases/CtsAppTestStubsApp1.apk in search directory /tmp/xts-root-dir-31f7ed76-90d3-4c87-9d46-ebc367af050b/android-cts/testcases.
12-12 15:02:38 D/RunUtil: Running command [aapt2, dump, badging, /tmp/xts-root-dir-31f7ed76-90d3-4c87-9d46-ebc367af050b/android-cts/testcases/CtsAppTestStubsApp1.apk] with timeout: 1m 0s
12-12 15:02:38 D/RunUtil: Running command [aapt2, dump, xmltree, /tmp/xts-root-dir-31f7ed76-90d3-4c87-9d46-ebc367af050b/android-cts/testcases/CtsAppTestStubsApp1.apk, --file, AndroidManifest.xml] with timeout: 1m 0s
12-12 15:02:38 D/TestAppInstallSetup: Installing apk com.android.app1 with [/tmp/xts-root-dir-31f7ed76-90d3-4c87-9d46-ebc367af050b/android-cts/testcases/CtsAppTestStubsApp1.apk] ...
12-12 15:02:38 D/NativeDevice: Using property ro.build.version.sdk=31 from cache.
12-12 15:02:38 D/CtsAppTestStubsApp1.apk: Uploading CtsAppTestStubsApp1.apk onto device 'SKBFX9C72AA'
12-12 15:02:38 D/DeviceImpl: Uploading file onto device 'SKBFX9C72AA'
12-12 15:02:41 D/RunUtil: Running command [aapt, dump, badging, /tmp/xts-root-dir-31f7ed76-90d3-4c87-9d46-ebc367af050b/android-cts/testcases/CtsAppTestStubsApp1.apk] with timeout: 1m 0s
12-12 15:02:41 D/RunUtil: Running command [aapt, dump, xmltree, /tmp/xts-root-dir-31f7ed76-90d3-4c87-9d46-ebc367af050b/android-cts/testcases/CtsAppTestStubsApp1.apk, AndroidManifest.xml] with timeout: 1m 0s
12-12 15:02:41 D/RunUtil: Running command [adb, -s, SKBFX9C72AA, shell, appops, write-settings] with timeout: 2m 0s
12-12 15:02:41 D/SearchArtifactUtil: Searching for file CtsAppTestStubsApp3.apk. Search directories: [/tmp/xts-root-dir-31f7ed76-90d3-4c87-9d46-ebc367af050b/android-cts/testcases, /tmp/xts-root-dir-31f7ed76-90d3-4c87-9d46-ebc367af050b/android-cts/testcases, /tmp/tf-workfolder1838493919733649928]
12-12 15:02:41 W/SearchArtifactUtil: we have a module name: CtsAppTestCases but no directory found in /tmp/xts-root-dir-31f7ed76-90d3-4c87-9d46-ebc367af050b/android-cts/testcases.
12-12 15:02:41 D/SearchArtifactUtil: Found file /tmp/xts-root-dir-31f7ed76-90d3-4c87-9d46-ebc367af050b/android-cts/testcases/CtsAppTestStubsApp3.apk in search directory /tmp/xts-root-dir-31f7ed76-90d3-4c87-9d46-ebc367af050b/android-cts/testcases.
12-12 15:02:41 D/RunUtil: Running command [aapt2, dump, badging, /tmp/xts-root-dir-31f7ed76-90d3-4c87-9d46-ebc367af050b/android-cts/testcases/CtsAppTestStubsApp3.apk] with timeout: 1m 0s
12-12 15:02:41 D/RunUtil: Running command [aapt2, dump, xmltree, /tmp/xts-root-dir-31f7ed76-90d3-4c87-9d46-ebc367af050b/android-cts/testcases/CtsAppTestStubsApp3.apk, --file, AndroidManifest.xml] with timeout: 1m 0s
12-12 15:02:41 D/TestAppInstallSetup: Installing apk com.android.app3 with [/tmp/xts-root-dir-31f7ed76-90d3-4c87-9d46-ebc367af050b/android-cts/testcases/CtsAppTestStubsApp3.apk] ...
12-12 15:02:41 D/NativeDevice: Using property ro.build.version.sdk=31 from cache.
12-12 15:02:41 D/CtsAppTestStubsApp3.apk: Uploading CtsAppTestStubsApp3.apk onto device 'SKBFX9C72AA'
12-12 15:02:41 D/DeviceImpl: Uploading file onto device 'SKBFX9C72AA'
12-12 15:02:43 D/RunUtil: Running command [aapt, dump, badging, /tmp/xts-root-dir-31f7ed76-90d3-4c87-9d46-ebc367af050b/android-cts/testcases/CtsAppTestStubsApp3.apk] with timeout: 1m 0s
12-12 15:02:43 D/RunUtil: Running command [aapt, dump, xmltree, /tmp/xts-root-dir-31f7ed76-90d3-4c87-9d46-ebc367af050b/android-cts/testcases/CtsAppTestStubsApp3.apk, AndroidManifest.xml] with timeout: 1m 0s
12-12 15:02:43 D/RunUtil: Running command [adb, -s, SKBFX9C72AA, shell, appops, write-settings] with timeout: 2m 0s
12-12 15:02:43 D/SearchArtifactUtil: Searching for file CtsAppTestStubsApp2.apk. Search directories: [/tmp/xts-root-dir-31f7ed76-90d3-4c87-9d46-ebc367af050b/android-cts/testcases, /tmp/xts-root-dir-31f7ed76-90d3-4c87-9d46-ebc367af050b/android-cts/testcases, /tmp/tf-workfolder1838493919733649928]
12-12 15:02:43 W/SearchArtifactUtil: we have a module name: CtsAppTestCases but no directory found in /tmp/xts-root-dir-31f7ed76-90d3-4c87-9d46-ebc367af050b/android-cts/testcases.
12-12 15:02:43 D/SearchArtifactUtil: Found file /tmp/xts-root-dir-31f7ed76-90d3-4c87-9d46-ebc367af050b/android-cts/testcases/CtsAppTestStubsApp2.apk in search directory /tmp/xts-root-dir-31f7ed76-90d3-4c87-9d46-ebc367af050b/android-cts/testcases.
12-12 15:02:43 D/RunUtil: Running command [aapt2, dump, badging, /tmp/xts-root-dir-31f7ed76-90d3-4c87-9d46-ebc367af050b/android-cts/testcases/CtsAppTestStubsApp2.apk] with timeout: 1m 0s
12-12 15:02:43 D/RunUtil: Running command [aapt2, dump, xmltree, /tmp/xts-root-dir-31f7ed76-90d3-4c87-9d46-ebc367af050b/android-cts/testcases/CtsAppTestStubsApp2.apk, --file, AndroidManifest.xml] with timeout: 1m 0s
12-12 15:02:43 D/TestAppInstallSetup: Installing apk com.android.app2 with [/tmp/xts-root-dir-31f7ed76-90d3-4c87-9d46-ebc367af050b/android-cts/testcases/CtsAppTestStubsApp2.apk] ...
12-12 15:02:43 D/NativeDevice: Using property ro.build.version.sdk=31 from cache.
12-12 15:02:43 D/CtsAppTestStubsApp2.apk: Uploading CtsAppTestStubsApp2.apk onto device 'SKBFX9C72AA'
12-12 15:02:43 D/DeviceImpl: Uploading file onto device 'SKBFX9C72AA'
12-12 15:02:45 D/RunUtil: Running command [aapt, dump, badging, /tmp/xts-root-dir-31f7ed76-90d3-4c87-9d46-ebc367af050b/android-cts/testcases/CtsAppTestStubsApp2.apk] with timeout: 1m 0s
12-12 15:02:45 D/RunUtil: Running command [aapt, dump, xmltree, /tmp/xts-root-dir-31f7ed76-90d3-4c87-9d46-ebc367af050b/android-cts/testcases/CtsAppTestStubsApp2.apk, AndroidManifest.xml] with timeout: 1m 0s
12-12 15:02:45 D/RunUtil: Running command [adb, -s, SKBFX9C72AA, shell, appops, write-settings] with timeout: 2m 0s
12-12 15:02:45 D/SearchArtifactUtil: Searching for file CtsAppTestStubsApi30.apk. Search directories: [/tmp/xts-root-dir-31f7ed76-90d3-4c87-9d46-ebc367af050b/android-cts/testcases, /tmp/xts-root-dir-31f7ed76-90d3-4c87-9d46-ebc367af050b/android-cts/testcases, /tmp/tf-workfolder1838493919733649928]
12-12 15:02:45 W/SearchArtifactUtil: we have a module name: CtsAppTestCases but no directory found in /tmp/xts-root-dir-31f7ed76-90d3-4c87-9d46-ebc367af050b/android-cts/testcases.
12-12 15:02:45 D/SearchArtifactUtil: Found file /tmp/xts-root-dir-31f7ed76-90d3-4c87-9d46-ebc367af050b/android-cts/testcases/CtsAppTestStubsApi30.apk in search directory /tmp/xts-root-dir-31f7ed76-90d3-4c87-9d46-ebc367af050b/android-cts/testcases.
12-12 15:02:45 D/RunUtil: Running command [aapt2, dump, badging, /tmp/xts-root-dir-31f7ed76-90d3-4c87-9d46-ebc367af050b/android-cts/testcases/CtsAppTestStubsApi30.apk] with timeout: 1m 0s
12-12 15:02:46 D/RunUtil: Running command [aapt2, dump, xmltree, /tmp/xts-root-dir-31f7ed76-90d3-4c87-9d46-ebc367af050b/android-cts/testcases/CtsAppTestStubsApi30.apk, --file, AndroidManifest.xml] with timeout: 1m 0s
12-12 15:02:46 D/TestAppInstallSetup: Installing apk com.android.app4 with [/tmp/xts-root-dir-31f7ed76-90d3-4c87-9d46-ebc367af050b/android-cts/testcases/CtsAppTestStubsApi30.apk] ...
12-12 15:02:46 D/NativeDevice: Using property ro.build.version.sdk=31 from cache.
12-12 15:02:46 D/CtsAppTestStubsApi30.apk: Uploading CtsAppTestStubsApi30.apk onto device 'SKBFX9C72AA'
12-12 15:02:46 D/DeviceImpl: Uploading file onto device 'SKBFX9C72AA'
12-12 15:02:46 D/RunUtil: Running command [aapt, dump, badging, /tmp/xts-root-dir-31f7ed76-90d3-4c87-9d46-ebc367af050b/android-cts/testcases/CtsAppTestStubsApi30.apk] with timeout: 1m 0s
12-12 15:02:46 D/RunUtil: Running command [aapt, dump, xmltree, /tmp/xts-root-dir-31f7ed76-90d3-4c87-9d46-ebc367af050b/android-cts/testcases/CtsAppTestStubsApi30.apk, AndroidManifest.xml] with timeout: 1m 0s
12-12 15:02:46 D/RunUtil: Running command [adb, -s, SKBFX9C72AA, shell, appops, write-settings] with timeout: 2m 0s
12-12 15:02:46 D/SearchArtifactUtil: Searching for file CtsAppTestCases.apk. Search directories: [/tmp/xts-root-dir-31f7ed76-90d3-4c87-9d46-ebc367af050b/android-cts/testcases, /tmp/xts-root-dir-31f7ed76-90d3-4c87-9d46-ebc367af050b/android-cts/testcases, /tmp/tf-workfolder1838493919733649928]
12-12 15:02:46 W/SearchArtifactUtil: we have a module name: CtsAppTestCases but no directory found in /tmp/xts-root-dir-31f7ed76-90d3-4c87-9d46-ebc367af050b/android-cts/testcases.
12-12 15:02:46 D/SearchArtifactUtil: Found file /tmp/xts-root-dir-31f7ed76-90d3-4c87-9d46-ebc367af050b/android-cts/testcases/CtsAppTestCases.apk in search directory /tmp/xts-root-dir-31f7ed76-90d3-4c87-9d46-ebc367af050b/android-cts/testcases.
12-12 15:02:46 D/RunUtil: Running command [aapt2, dump, badging, /tmp/xts-root-dir-31f7ed76-90d3-4c87-9d46-ebc367af050b/android-cts/testcases/CtsAppTestCases.apk] with timeout: 1m 0s
12-12 15:02:46 D/RunUtil: Running command [aapt2, dump, xmltree, /tmp/xts-root-dir-31f7ed76-90d3-4c87-9d46-ebc367af050b/android-cts/testcases/CtsAppTestCases.apk, --file, AndroidManifest.xml] with timeout: 1m 0s
12-12 15:02:46 D/TestAppInstallSetup: Installing apk android.app.cts with [/tmp/xts-root-dir-31f7ed76-90d3-4c87-9d46-ebc367af050b/android-cts/testcases/CtsAppTestCases.apk] ...
12-12 15:02:46 D/NativeDevice: Using property ro.build.version.sdk=31 from cache.
12-12 15:02:46 D/CtsAppTestCases.apk: Uploading CtsAppTestCases.apk onto device 'SKBFX9C72AA'
12-12 15:02:46 D/DeviceImpl: Uploading file onto device 'SKBFX9C72AA'
12-12 15:02:49 D/RunUtil: Running command [aapt, dump, badging, /tmp/xts-root-dir-31f7ed76-90d3-4c87-9d46-ebc367af050b/android-cts/testcases/CtsAppTestCases.apk] with timeout: 1m 0s
12-12 15:02:49 D/RunUtil: Running command [aapt, dump, xmltree, /tmp/xts-root-dir-31f7ed76-90d3-4c87-9d46-ebc367af050b/android-cts/testcases/CtsAppTestCases.apk, AndroidManifest.xml] with timeout: 1m 0s
12-12 15:02:49 D/RunUtil: Running command [adb, -s, SKBFX9C72AA, shell, appops, write-settings] with timeout: 2m 0s
12-12 15:02:49 D/SearchArtifactUtil: Searching for file CtsBadProviderStubs.apk. Search directories: [/tmp/xts-root-dir-31f7ed76-90d3-4c87-9d46-ebc367af050b/android-cts/testcases, /tmp/xts-root-dir-31f7ed76-90d3-4c87-9d46-ebc367af050b/android-cts/testcases, /tmp/tf-workfolder1838493919733649928]
12-12 15:02:50 W/SearchArtifactUtil: we have a module name: CtsAppTestCases but no directory found in /tmp/xts-root-dir-31f7ed76-90d3-4c87-9d46-ebc367af050b/android-cts/testcases.
12-12 15:02:50 D/SearchArtifactUtil: Found file /tmp/xts-root-dir-31f7ed76-90d3-4c87-9d46-ebc367af050b/android-cts/testcases/CtsBadProviderStubs.apk in search directory /tmp/xts-root-dir-31f7ed76-90d3-4c87-9d46-ebc367af050b/android-cts/testcases.
12-12 15:02:50 D/RunUtil: Running command [aapt2, dump, badging, /tmp/xts-root-dir-31f7ed76-90d3-4c87-9d46-ebc367af050b/android-cts/testcases/CtsBadProviderStubs.apk] with timeout: 1m 0s
12-12 15:02:50 D/RunUtil: Running command [aapt2, dump, xmltree, /tmp/xts-root-dir-31f7ed76-90d3-4c87-9d46-ebc367af050b/android-cts/testcases/CtsBadProviderStubs.apk, --file, AndroidManifest.xml] with timeout: 1m 0s
12-12 15:02:50 D/TestAppInstallSetup: Installing apk com.android.cts.stubbad with [/tmp/xts-root-dir-31f7ed76-90d3-4c87-9d46-ebc367af050b/android-cts/testcases/CtsBadProviderStubs.apk] ...
12-12 15:02:50 D/NativeDevice: Using property ro.build.version.sdk=31 from cache.
12-12 15:02:50 D/CtsBadProviderStubs.apk: Uploading CtsBadProviderStubs.apk onto device 'SKBFX9C72AA'
12-12 15:02:50 D/DeviceImpl: Uploading file onto device 'SKBFX9C72AA'
12-12 15:02:50 D/RunUtil: Running command [aapt, dump, badging, /tmp/xts-root-dir-31f7ed76-90d3-4c87-9d46-ebc367af050b/android-cts/testcases/CtsBadProviderStubs.apk] with timeout: 1m 0s
12-12 15:02:50 D/RunUtil: Running command [aapt, dump, xmltree, /tmp/xts-root-dir-31f7ed76-90d3-4c87-9d46-ebc367af050b/android-cts/testcases/CtsBadProviderStubs.apk, AndroidManifest.xml] with timeout: 1m 0s
12-12 15:02:50 D/RunUtil: Running command [adb, -s, SKBFX9C72AA, shell, appops, write-settings] with timeout: 2m 0s
12-12 15:02:50 D/SearchArtifactUtil: Searching for file CtsCantSaveState1.apk. Search directories: [/tmp/xts-root-dir-31f7ed76-90d3-4c87-9d46-ebc367af050b/android-cts/testcases, /tmp/xts-root-dir-31f7ed76-90d3-4c87-9d46-ebc367af050b/android-cts/testcases, /tmp/tf-workfolder1838493919733649928]
12-12 15:02:50 W/SearchArtifactUtil: we have a module name: CtsAppTestCases but no directory found in /tmp/xts-root-dir-31f7ed76-90d3-4c87-9d46-ebc367af050b/android-cts/testcases.
12-12 15:02:50 D/SearchArtifactUtil: Found file /tmp/xts-root-dir-31f7ed76-90d3-4c87-9d46-ebc367af050b/android-cts/testcases/CtsCantSaveState1.apk in search directory /tmp/xts-root-dir-31f7ed76-90d3-4c87-9d46-ebc367af050b/android-cts/testcases.
12-12 15:02:50 D/RunUtil: Running command [aapt2, dump, badging, /tmp/xts-root-dir-31f7ed76-90d3-4c87-9d46-ebc367af050b/android-cts/testcases/CtsCantSaveState1.apk] with timeout: 1m 0s
12-12 15:02:50 D/RunUtil: Running command [aapt2, dump, xmltree, /tmp/xts-root-dir-31f7ed76-90d3-4c87-9d46-ebc367af050b/android-cts/testcases/CtsCantSaveState1.apk, --file, AndroidManifest.xml] with timeout: 1m 0s
12-12 15:02:50 D/TestAppInstallSetup: Installing apk com.android.test.cantsavestate1 with [/tmp/xts-root-dir-31f7ed76-90d3-4c87-9d46-ebc367af050b/android-cts/testcases/CtsCantSaveState1.apk] ...
12-12 15:02:50 D/NativeDevice: Using property ro.build.version.sdk=31 from cache.
12-12 15:02:50 D/CtsCantSaveState1.apk: Uploading CtsCantSaveState1.apk onto device 'SKBFX9C72AA'
12-12 15:02:50 D/DeviceImpl: Uploading file onto device 'SKBFX9C72AA'
12-12 15:02:51 D/RunUtil: Running command [aapt, dump, badging, /tmp/xts-root-dir-31f7ed76-90d3-4c87-9d46-ebc367af050b/android-cts/testcases/CtsCantSaveState1.apk] with timeout: 1m 0s
12-12 15:02:51 D/RunUtil: Running command [aapt, dump, xmltree, /tmp/xts-root-dir-31f7ed76-90d3-4c87-9d46-ebc367af050b/android-cts/testcases/CtsCantSaveState1.apk, AndroidManifest.xml] with timeout: 1m 0s
12-12 15:02:51 D/RunUtil: Running command [adb, -s, SKBFX9C72AA, shell, appops, write-settings] with timeout: 2m 0s
12-12 15:02:51 D/SearchArtifactUtil: Searching for file CtsCantSaveState2.apk. Search directories: [/tmp/xts-root-dir-31f7ed76-90d3-4c87-9d46-ebc367af050b/android-cts/testcases, /tmp/xts-root-dir-31f7ed76-90d3-4c87-9d46-ebc367af050b/android-cts/testcases, /tmp/tf-workfolder1838493919733649928]
12-12 15:02:51 W/SearchArtifactUtil: we have a module name: CtsAppTestCases but no directory found in /tmp/xts-root-dir-31f7ed76-90d3-4c87-9d46-ebc367af050b/android-cts/testcases.
12-12 15:02:51 D/SearchArtifactUtil: Found file /tmp/xts-root-dir-31f7ed76-90d3-4c87-9d46-ebc367af050b/android-cts/testcases/CtsCantSaveState2.apk in search directory /tmp/xts-root-dir-31f7ed76-90d3-4c87-9d46-ebc367af050b/android-cts/testcases.
12-12 15:02:51 D/RunUtil: Running command [aapt2, dump, badging, /tmp/xts-root-dir-31f7ed76-90d3-4c87-9d46-ebc367af050b/android-cts/testcases/CtsCantSaveState2.apk] with timeout: 1m 0s
12-12 15:02:51 D/RunUtil: Running command [aapt2, dump, xmltree, /tmp/xts-root-dir-31f7ed76-90d3-4c87-9d46-ebc367af050b/android-cts/testcases/CtsCantSaveState2.apk, --file, AndroidManifest.xml] with timeout: 1m 0s
12-12 15:02:51 D/TestAppInstallSetup: Installing apk com.android.test.cantsavestate2 with [/tmp/xts-root-dir-31f7ed76-90d3-4c87-9d46-ebc367af050b/android-cts/testcases/CtsCantSaveState2.apk] ...
12-12 15:02:51 D/NativeDevice: Using property ro.build.version.sdk=31 from cache.
12-12 15:02:51 D/CtsCantSaveState2.apk: Uploading CtsCantSaveState2.apk onto device 'SKBFX9C72AA'
12-12 15:02:51 D/DeviceImpl: Uploading file onto device 'SKBFX9C72AA'
12-12 15:02:52 D/RunUtil: Running command [aapt, dump, badging, /tmp/xts-root-dir-31f7ed76-90d3-4c87-9d46-ebc367af050b/android-cts/testcases/CtsCantSaveState2.apk] with timeout: 1m 0s
12-12 15:02:52 D/RunUtil: Running command [aapt, dump, xmltree, /tmp/xts-root-dir-31f7ed76-90d3-4c87-9d46-ebc367af050b/android-cts/testcases/CtsCantSaveState2.apk, AndroidManifest.xml] with timeout: 1m 0s
12-12 15:02:52 D/RunUtil: Running command [adb, -s, SKBFX9C72AA, shell, appops, write-settings] with timeout: 2m 0s
12-12 15:02:52 D/SearchArtifactUtil: Searching for file NotificationDelegator.apk. Search directories: [/tmp/xts-root-dir-31f7ed76-90d3-4c87-9d46-ebc367af050b/android-cts/testcases, /tmp/xts-root-dir-31f7ed76-90d3-4c87-9d46-ebc367af050b/android-cts/testcases, /tmp/tf-workfolder1838493919733649928]
12-12 15:02:52 W/SearchArtifactUtil: we have a module name: CtsAppTestCases but no directory found in /tmp/xts-root-dir-31f7ed76-90d3-4c87-9d46-ebc367af050b/android-cts/testcases.
12-12 15:02:52 D/SearchArtifactUtil: Found file /tmp/xts-root-dir-31f7ed76-90d3-4c87-9d46-ebc367af050b/android-cts/testcases/NotificationDelegator.apk in search directory /tmp/xts-root-dir-31f7ed76-90d3-4c87-9d46-ebc367af050b/android-cts/testcases.
12-12 15:02:52 D/RunUtil: Running command [aapt2, dump, badging, /tmp/xts-root-dir-31f7ed76-90d3-4c87-9d46-ebc367af050b/android-cts/testcases/NotificationDelegator.apk] with timeout: 1m 0s
12-12 15:02:52 D/RunUtil: Running command [aapt2, dump, xmltree, /tmp/xts-root-dir-31f7ed76-90d3-4c87-9d46-ebc367af050b/android-cts/testcases/NotificationDelegator.apk, --file, AndroidManifest.xml] with timeout: 1m 0s
12-12 15:02:52 D/TestAppInstallSetup: Installing apk com.android.test.notificationdelegator with [/tmp/xts-root-dir-31f7ed76-90d3-4c87-9d46-ebc367af050b/android-cts/testcases/NotificationDelegator.apk] ...
12-12 15:02:52 D/NativeDevice: Using property ro.build.version.sdk=31 from cache.
12-12 15:02:52 D/NotificationDelegator.apk: Uploading NotificationDelegator.apk onto device 'SKBFX9C72AA'
12-12 15:02:52 D/DeviceImpl: Uploading file onto device 'SKBFX9C72AA'
12-12 15:02:52 D/RunUtil: Running command [aapt, dump, badging, /tmp/xts-root-dir-31f7ed76-90d3-4c87-9d46-ebc367af050b/android-cts/testcases/NotificationDelegator.apk] with timeout: 1m 0s
12-12 15:02:52 D/RunUtil: Running command [aapt, dump, xmltree, /tmp/xts-root-dir-31f7ed76-90d3-4c87-9d46-ebc367af050b/android-cts/testcases/NotificationDelegator.apk, AndroidManifest.xml] with timeout: 1m 0s
12-12 15:02:52 D/RunUtil: Running command [adb, -s, SKBFX9C72AA, shell, appops, write-settings] with timeout: 2m 0s
12-12 15:02:52 D/SearchArtifactUtil: Searching for file NotificationProvider.apk. Search directories: [/tmp/xts-root-dir-31f7ed76-90d3-4c87-9d46-ebc367af050b/android-cts/testcases, /tmp/xts-root-dir-31f7ed76-90d3-4c87-9d46-ebc367af050b/android-cts/testcases, /tmp/tf-workfolder1838493919733649928]
12-12 15:02:52 W/SearchArtifactUtil: we have a module name: CtsAppTestCases but no directory found in /tmp/xts-root-dir-31f7ed76-90d3-4c87-9d46-ebc367af050b/android-cts/testcases.
12-12 15:02:53 D/SearchArtifactUtil: Found file /tmp/xts-root-dir-31f7ed76-90d3-4c87-9d46-ebc367af050b/android-cts/testcases/NotificationProvider.apk in search directory /tmp/xts-root-dir-31f7ed76-90d3-4c87-9d46-ebc367af050b/android-cts/testcases.
12-12 15:02:53 D/RunUtil: Running command [aapt2, dump, badging, /tmp/xts-root-dir-31f7ed76-90d3-4c87-9d46-ebc367af050b/android-cts/testcases/NotificationProvider.apk] with timeout: 1m 0s
12-12 15:02:53 D/RunUtil: Running command [aapt2, dump, xmltree, /tmp/xts-root-dir-31f7ed76-90d3-4c87-9d46-ebc367af050b/android-cts/testcases/NotificationProvider.apk, --file, AndroidManifest.xml] with timeout: 1m 0s
12-12 15:02:53 D/TestAppInstallSetup: Installing apk com.android.test.notificationprovider with [/tmp/xts-root-dir-31f7ed76-90d3-4c87-9d46-ebc367af050b/android-cts/testcases/NotificationProvider.apk] ...
12-12 15:02:53 D/NativeDevice: Using property ro.build.version.sdk=31 from cache.
12-12 15:02:53 D/NotificationProvider.apk: Uploading NotificationProvider.apk onto device 'SKBFX9C72AA'
12-12 15:02:53 D/DeviceImpl: Uploading file onto device 'SKBFX9C72AA'
12-12 15:02:53 D/RunUtil: Running command [aapt, dump, badging, /tmp/xts-root-dir-31f7ed76-90d3-4c87-9d46-ebc367af050b/android-cts/testcases/NotificationProvider.apk] with timeout: 1m 0s
12-12 15:02:53 D/RunUtil: Running command [aapt, dump, xmltree, /tmp/xts-root-dir-31f7ed76-90d3-4c87-9d46-ebc367af050b/android-cts/testcases/NotificationProvider.apk, AndroidManifest.xml] with timeout: 1m 0s
12-12 15:02:53 D/RunUtil: Running command [adb, -s, SKBFX9C72AA, shell, appops, write-settings] with timeout: 2m 0s
12-12 15:02:53 D/SearchArtifactUtil: Searching for file NotificationListener.apk. Search directories: [/tmp/xts-root-dir-31f7ed76-90d3-4c87-9d46-ebc367af050b/android-cts/testcases, /tmp/xts-root-dir-31f7ed76-90d3-4c87-9d46-ebc367af050b/android-cts/testcases, /tmp/tf-workfolder1838493919733649928]
12-12 15:02:53 W/SearchArtifactUtil: we have a module name: CtsAppTestCases but no directory found in /tmp/xts-root-dir-31f7ed76-90d3-4c87-9d46-ebc367af050b/android-cts/testcases.
12-12 15:02:53 D/SearchArtifactUtil: Found file /tmp/xts-root-dir-31f7ed76-90d3-4c87-9d46-ebc367af050b/android-cts/testcases/NotificationListener.apk in search directory /tmp/xts-root-dir-31f7ed76-90d3-4c87-9d46-ebc367af050b/android-cts/testcases.
12-12 15:02:53 D/RunUtil: Running command [aapt2, dump, badging, /tmp/xts-root-dir-31f7ed76-90d3-4c87-9d46-ebc367af050b/android-cts/testcases/NotificationListener.apk] with timeout: 1m 0s
12-12 15:02:53 D/RunUtil: Running command [aapt2, dump, xmltree, /tmp/xts-root-dir-31f7ed76-90d3-4c87-9d46-ebc367af050b/android-cts/testcases/NotificationListener.apk, --file, AndroidManifest.xml] with timeout: 1m 0s
12-12 15:02:54 D/TestAppInstallSetup: Installing apk com.android.test.notificationlistener with [/tmp/xts-root-dir-31f7ed76-90d3-4c87-9d46-ebc367af050b/android-cts/testcases/NotificationListener.apk] ...
12-12 15:02:54 D/NativeDevice: Using property ro.build.version.sdk=31 from cache.
12-12 15:02:54 D/NotificationListener.apk: Uploading NotificationListener.apk onto device 'SKBFX9C72AA'
12-12 15:02:54 D/DeviceImpl: Uploading file onto device 'SKBFX9C72AA'
12-12 15:02:54 D/RunUtil: Running command [aapt, dump, badging, /tmp/xts-root-dir-31f7ed76-90d3-4c87-9d46-ebc367af050b/android-cts/testcases/NotificationListener.apk] with timeout: 1m 0s
12-12 15:02:54 D/RunUtil: Running command [aapt, dump, xmltree, /tmp/xts-root-dir-31f7ed76-90d3-4c87-9d46-ebc367af050b/android-cts/testcases/NotificationListener.apk, AndroidManifest.xml] with timeout: 1m 0s
12-12 15:02:54 D/RunUtil: Running command [adb, -s, SKBFX9C72AA, shell, appops, write-settings] with timeout: 2m 0s
12-12 15:02:54 D/SearchArtifactUtil: Searching for file StorageDelegator.apk. Search directories: [/tmp/xts-root-dir-31f7ed76-90d3-4c87-9d46-ebc367af050b/android-cts/testcases, /tmp/xts-root-dir-31f7ed76-90d3-4c87-9d46-ebc367af050b/android-cts/testcases, /tmp/tf-workfolder1838493919733649928]
12-12 15:02:54 W/SearchArtifactUtil: we have a module name: CtsAppTestCases but no directory found in /tmp/xts-root-dir-31f7ed76-90d3-4c87-9d46-ebc367af050b/android-cts/testcases.
12-12 15:02:55 D/SearchArtifactUtil: Found file /tmp/xts-root-dir-31f7ed76-90d3-4c87-9d46-ebc367af050b/android-cts/testcases/StorageDelegator.apk in search directory /tmp/xts-root-dir-31f7ed76-90d3-4c87-9d46-ebc367af050b/android-cts/testcases.
12-12 15:02:55 D/RunUtil: Running command [aapt2, dump, badging, /tmp/xts-root-dir-31f7ed76-90d3-4c87-9d46-ebc367af050b/android-cts/testcases/StorageDelegator.apk] with timeout: 1m 0s
12-12 15:02:55 D/RunUtil: Running command [aapt2, dump, xmltree, /tmp/xts-root-dir-31f7ed76-90d3-4c87-9d46-ebc367af050b/android-cts/testcases/StorageDelegator.apk, --file, AndroidManifest.xml] with timeout: 1m 0s
12-12 15:02:55 D/TestAppInstallSetup: Installing apk com.android.test.storagedelegator with [/tmp/xts-root-dir-31f7ed76-90d3-4c87-9d46-ebc367af050b/android-cts/testcases/StorageDelegator.apk] ...
12-12 15:02:55 D/NativeDevice: Using property ro.build.version.sdk=31 from cache.
12-12 15:02:55 D/StorageDelegator.apk: Uploading StorageDelegator.apk onto device 'SKBFX9C72AA'
12-12 15:02:55 D/DeviceImpl: Uploading file onto device 'SKBFX9C72AA'
12-12 15:02:55 D/RunUtil: Running command [aapt, dump, badging, /tmp/xts-root-dir-31f7ed76-90d3-4c87-9d46-ebc367af050b/android-cts/testcases/StorageDelegator.apk] with timeout: 1m 0s
12-12 15:02:55 D/RunUtil: Running command [aapt, dump, xmltree, /tmp/xts-root-dir-31f7ed76-90d3-4c87-9d46-ebc367af050b/android-cts/testcases/StorageDelegator.apk, AndroidManifest.xml] with timeout: 1m 0s
12-12 15:02:55 D/RunUtil: Running command [adb, -s, SKBFX9C72AA, shell, appops, write-settings] with timeout: 2m 0s
12-12 15:02:55 D/SearchArtifactUtil: Searching for file CtsActivityManagerApi29.apk. Search directories: [/tmp/xts-root-dir-31f7ed76-90d3-4c87-9d46-ebc367af050b/android-cts/testcases, /tmp/xts-root-dir-31f7ed76-90d3-4c87-9d46-ebc367af050b/android-cts/testcases, /tmp/tf-workfolder1838493919733649928]
12-12 15:02:55 W/SearchArtifactUtil: we have a module name: CtsAppTestCases but no directory found in /tmp/xts-root-dir-31f7ed76-90d3-4c87-9d46-ebc367af050b/android-cts/testcases.
12-12 15:02:55 D/SearchArtifactUtil: Found file /tmp/xts-root-dir-31f7ed76-90d3-4c87-9d46-ebc367af050b/android-cts/testcases/CtsActivityManagerApi29.apk in search directory /tmp/xts-root-dir-31f7ed76-90d3-4c87-9d46-ebc367af050b/android-cts/testcases.
12-12 15:02:55 D/RunUtil: Running command [aapt2, dump, badging, /tmp/xts-root-dir-31f7ed76-90d3-4c87-9d46-ebc367af050b/android-cts/testcases/CtsActivityManagerApi29.apk] with timeout: 1m 0s
12-12 15:02:55 D/RunUtil: Running command [aapt2, dump, xmltree, /tmp/xts-root-dir-31f7ed76-90d3-4c87-9d46-ebc367af050b/android-cts/testcases/CtsActivityManagerApi29.apk, --file, AndroidManifest.xml] with timeout: 1m 0s
12-12 15:02:55 D/TestAppInstallSetup: Installing apk android.app.cts.activitymanager.api29 with [/tmp/xts-root-dir-31f7ed76-90d3-4c87-9d46-ebc367af050b/android-cts/testcases/CtsActivityManagerApi29.apk] ...
12-12 15:02:55 D/NativeDevice: Using property ro.build.version.sdk=31 from cache.
12-12 15:02:55 D/CtsActivityManagerApi29.apk: Uploading CtsActivityManagerApi29.apk onto device 'SKBFX9C72AA'
12-12 15:02:55 D/DeviceImpl: Uploading file onto device 'SKBFX9C72AA'
12-12 15:02:56 D/RunUtil: Running command [aapt, dump, badging, /tmp/xts-root-dir-31f7ed76-90d3-4c87-9d46-ebc367af050b/android-cts/testcases/CtsActivityManagerApi29.apk] with timeout: 1m 0s
12-12 15:02:56 D/RunUtil: Running command [aapt, dump, xmltree, /tmp/xts-root-dir-31f7ed76-90d3-4c87-9d46-ebc367af050b/android-cts/testcases/CtsActivityManagerApi29.apk, AndroidManifest.xml] with timeout: 1m 0s
12-12 15:02:56 D/RunUtil: Running command [adb, -s, SKBFX9C72AA, shell, appops, write-settings] with timeout: 2m 0s
12-12 15:02:56 D/SearchArtifactUtil: Searching for file NotificationTrampoline.apk. Search directories: [/tmp/xts-root-dir-31f7ed76-90d3-4c87-9d46-ebc367af050b/android-cts/testcases, /tmp/xts-root-dir-31f7ed76-90d3-4c87-9d46-ebc367af050b/android-cts/testcases, /tmp/tf-workfolder1838493919733649928]
12-12 15:02:56 W/SearchArtifactUtil: we have a module name: CtsAppTestCases but no directory found in /tmp/xts-root-dir-31f7ed76-90d3-4c87-9d46-ebc367af050b/android-cts/testcases.
12-12 15:02:56 D/SearchArtifactUtil: Found file /tmp/xts-root-dir-31f7ed76-90d3-4c87-9d46-ebc367af050b/android-cts/testcases/NotificationTrampoline.apk in search directory /tmp/xts-root-dir-31f7ed76-90d3-4c87-9d46-ebc367af050b/android-cts/testcases.
12-12 15:02:56 D/RunUtil: Running command [aapt2, dump, badging, /tmp/xts-root-dir-31f7ed76-90d3-4c87-9d46-ebc367af050b/android-cts/testcases/NotificationTrampoline.apk] with timeout: 1m 0s
12-12 15:02:56 D/RunUtil: Running command [aapt2, dump, xmltree, /tmp/xts-root-dir-31f7ed76-90d3-4c87-9d46-ebc367af050b/android-cts/testcases/NotificationTrampoline.apk, --file, AndroidManifest.xml] with timeout: 1m 0s
12-12 15:02:56 D/TestAppInstallSetup: Installing apk com.android.test.notificationtrampoline.current with [/tmp/xts-root-dir-31f7ed76-90d3-4c87-9d46-ebc367af050b/android-cts/testcases/NotificationTrampoline.apk] ...
12-12 15:02:56 D/NativeDevice: Using property ro.build.version.sdk=31 from cache.
12-12 15:02:56 D/NotificationTrampoline.apk: Uploading NotificationTrampoline.apk onto device 'SKBFX9C72AA'
12-12 15:02:56 D/DeviceImpl: Uploading file onto device 'SKBFX9C72AA'
12-12 15:02:57 D/RunUtil: Running command [aapt, dump, badging, /tmp/xts-root-dir-31f7ed76-90d3-4c87-9d46-ebc367af050b/android-cts/testcases/NotificationTrampoline.apk] with timeout: 1m 0s
12-12 15:02:57 D/RunUtil: Running command [aapt, dump, xmltree, /tmp/xts-root-dir-31f7ed76-90d3-4c87-9d46-ebc367af050b/android-cts/testcases/NotificationTrampoline.apk, AndroidManifest.xml] with timeout: 1m 0s
12-12 15:02:57 D/RunUtil: Running command [adb, -s, SKBFX9C72AA, shell, appops, write-settings] with timeout: 2m 0s
12-12 15:02:57 D/SearchArtifactUtil: Searching for file NotificationTrampolineApi30.apk. Search directories: [/tmp/xts-root-dir-31f7ed76-90d3-4c87-9d46-ebc367af050b/android-cts/testcases, /tmp/xts-root-dir-31f7ed76-90d3-4c87-9d46-ebc367af050b/android-cts/testcases, /tmp/tf-workfolder1838493919733649928]
12-12 15:02:57 W/SearchArtifactUtil: we have a module name: CtsAppTestCases but no directory found in /tmp/xts-root-dir-31f7ed76-90d3-4c87-9d46-ebc367af050b/android-cts/testcases.
12-12 15:02:57 D/SearchArtifactUtil: Found file /tmp/xts-root-dir-31f7ed76-90d3-4c87-9d46-ebc367af050b/android-cts/testcases/NotificationTrampolineApi30.apk in search directory /tmp/xts-root-dir-31f7ed76-90d3-4c87-9d46-ebc367af050b/android-cts/testcases.
12-12 15:02:57 D/RunUtil: Running command [aapt2, dump, badging, /tmp/xts-root-dir-31f7ed76-90d3-4c87-9d46-ebc367af050b/android-cts/testcases/NotificationTrampolineApi30.apk] with timeout: 1m 0s
12-12 15:02:57 D/RunUtil: Running command [aapt2, dump, xmltree, /tmp/xts-root-dir-31f7ed76-90d3-4c87-9d46-ebc367af050b/android-cts/testcases/NotificationTrampolineApi30.apk, --file, AndroidManifest.xml] with timeout: 1m 0s
12-12 15:02:57 D/TestAppInstallSetup: Installing apk com.android.test.notificationtrampoline.api30 with [/tmp/xts-root-dir-31f7ed76-90d3-4c87-9d46-ebc367af050b/android-cts/testcases/NotificationTrampolineApi30.apk] ...
12-12 15:02:57 D/NativeDevice: Using property ro.build.version.sdk=31 from cache.
12-12 15:02:57 D/NotificationTrampolineApi30.apk: Uploading NotificationTrampolineApi30.apk onto device 'SKBFX9C72AA'
12-12 15:02:57 D/DeviceImpl: Uploading file onto device 'SKBFX9C72AA'
12-12 15:02:57 D/RunUtil: Running command [aapt, dump, badging, /tmp/xts-root-dir-31f7ed76-90d3-4c87-9d46-ebc367af050b/android-cts/testcases/NotificationTrampolineApi30.apk] with timeout: 1m 0s
12-12 15:02:57 D/RunUtil: Running command [aapt, dump, xmltree, /tmp/xts-root-dir-31f7ed76-90d3-4c87-9d46-ebc367af050b/android-cts/testcases/NotificationTrampolineApi30.apk, AndroidManifest.xml] with timeout: 1m 0s
12-12 15:02:57 D/RunUtil: Running command [adb, -s, SKBFX9C72AA, shell, appops, write-settings] with timeout: 2m 0s
12-12 15:02:58 D/ModuleDefinition: Running setup preparer: RunCommandTargetPreparer
12-12 15:02:58 D/RunUtil: Running command [adb, -s, SKBFX9C72AA, shell, input, keyevent, KEYCODE_WAKEUP] with timeout: 2m 0s
12-12 15:02:58 D/RunUtil: Running command [adb, -s, SKBFX9C72AA, shell, wm, dismiss-keyguard] with timeout: 2m 0s
12-12 15:02:58 D/RunUtil: Running command [adb, -s, SKBFX9C72AA, shell, settings, put, global, cw_disable_wifimediator, 1] with timeout: 2m 0s
12-12 15:02:58 D/NativeDevice: Using property ro.build.version.sdk=31 from cache.
12-12 15:02:58 D/NativeDevice: Using property ro.build.version.codename=REL from cache.
12-12 15:02:58 D/NativeDevice: Using property ro.build.version.sdk=31 from cache.
12-12 15:02:58 D/NativeDevice: Using property ro.build.version.codename=REL from cache.
12-12 15:02:58 D/AndroidJUnitTest: Disabled test storage as it's not supported on that branch.
12-12 15:02:58 D/AndroidJUnitTest: Attempting to push filters to /data/local/tmp/ajur/includes.txt
12-12 15:02:58 D/NativeDevice: Using 'ls' to check doesFileExist(/data/local/tmp/ajur)
12-12 15:02:58 D/RunUtil: Running command [adb, -s, SKBFX9C72AA, shell, ls, '/data/local/tmp/ajur'] with timeout: 2m 0s
12-12 15:02:58 D/NativeDevice: File /data/local/tmp/ajur does not exist.
stdout: 
stderr: ls: /data/local/tmp/ajur: No such file or directory

12-12 15:02:58 D/NativeDevice: Using 'ls' to check doesFileExist(/data/local/tmp/ajur/includes.txt)
12-12 15:02:58 D/RunUtil: Running command [adb, -s, SKBFX9C72AA, shell, ls, '/data/local/tmp/ajur/includes.txt'] with timeout: 2m 0s
12-12 15:02:58 D/FileUtil: Creating temp file at /tmp/xts-root-dir-31f7ed76-90d3-4c87-9d46-ebc367af050b/android-cts/logs/2025.12.12_15.02.01/inv_8470258709435509936 with prefix "filter-armeabi-v7a%20CtsAppTestCases826822482017068494.include_" suffix ".txt.gz"
12-12 15:02:58 I/LogFileSaver: Saved gzip log file /tmp/xts-root-dir-31f7ed76-90d3-4c87-9d46-ebc367af050b/android-cts/logs/2025.12.12_15.02.01/inv_8470258709435509936/filter-armeabi-v7a%20CtsAppTestCases826822482017068494.include_6924677329142330610.txt.gz. [size=10, elapsed=1ms]
12-12 15:02:58 D/CertificationSuiteResultReporter: Saved logs for filter-armeabi-v7a%20CtsAppTestCases826822482017068494.include in /tmp/xts-root-dir-31f7ed76-90d3-4c87-9d46-ebc367af050b/android-cts/logs/2025.12.12_15.02.01/inv_8470258709435509936/filter-armeabi-v7a%20CtsAppTestCases826822482017068494.include_6924677329142330610.txt.gz
12-12 15:02:58 D/FileUtil: Creating temp file at /tmp/13441469/cts/inv_14577056596028725407/inv_2914749876990745416 with prefix "filter-armeabi-v7a%20CtsAppTestCases826822482017068494.include_" suffix ".txt.gz"
12-12 15:02:58 I/LogFileSaver: Saved gzip log file /tmp/13441469/cts/inv_14577056596028725407/inv_2914749876990745416/filter-armeabi-v7a%20CtsAppTestCases826822482017068494.include_7046539687846645226.txt.gz. [size=10, elapsed=0ms]
12-12 15:02:58 D/AndroidJUnitTest: Attempting to push filters to /data/local/tmp/ajur/excludes.txt
12-12 15:02:58 D/NativeDevice: Using 'ls' to check doesFileExist(/data/local/tmp/ajur)
12-12 15:02:58 D/RunUtil: Running command [adb, -s, SKBFX9C72AA, shell, ls, '/data/local/tmp/ajur'] with timeout: 2m 0s
12-12 15:02:58 D/FileUtil: Creating temp file at /tmp/xts-root-dir-31f7ed76-90d3-4c87-9d46-ebc367af050b/android-cts/logs/2025.12.12_15.02.01/inv_8470258709435509936 with prefix "filter-armeabi-v7a%20CtsAppTestCases17771595306812273145.exclude_" suffix ".txt.gz"
12-12 15:02:58 I/LogFileSaver: Saved gzip log file /tmp/xts-root-dir-31f7ed76-90d3-4c87-9d46-ebc367af050b/android-cts/logs/2025.12.12_15.02.01/inv_8470258709435509936/filter-armeabi-v7a%20CtsAppTestCases17771595306812273145.exclude_18321070170718884986.txt.gz. [size=10, elapsed=1ms]
12-12 15:02:58 D/CertificationSuiteResultReporter: Saved logs for filter-armeabi-v7a%20CtsAppTestCases17771595306812273145.exclude in /tmp/xts-root-dir-31f7ed76-90d3-4c87-9d46-ebc367af050b/android-cts/logs/2025.12.12_15.02.01/inv_8470258709435509936/filter-armeabi-v7a%20CtsAppTestCases17771595306812273145.exclude_18321070170718884986.txt.gz
12-12 15:02:58 D/FileUtil: Creating temp file at /tmp/13441469/cts/inv_14577056596028725407/inv_2914749876990745416 with prefix "filter-armeabi-v7a%20CtsAppTestCases17771595306812273145.exclude_" suffix ".txt.gz"
12-12 15:02:58 I/LogFileSaver: Saved gzip log file /tmp/13441469/cts/inv_14577056596028725407/inv_2914749876990745416/filter-armeabi-v7a%20CtsAppTestCases17771595306812273145.exclude_819189172458187388.txt.gz. [size=10, elapsed=0ms]
12-12 15:02:58 D/NativeDevice: Using property ro.build.version.sdk=31 from cache.
12-12 15:02:58 D/NativeDevice: Using property ro.build.version.sdk=31 from cache.
12-12 15:02:58 D/NativeDevice: Using property ro.build.version.codename=REL from cache.
12-12 15:02:58 D/NativeDevice: Using property ro.build.version.sdk=31 from cache.
12-12 15:02:58 D/InstrumentationTest: Collecting test info for android.app.cts on device SKBFX9C72AA
12-12 15:02:58 I/RemoteAndroidTestRunner: Running am instrument -w -r --no-hidden-api-checks --abi armeabi-v7a  -e testFile /data/local/tmp/ajur/includes.txt -e debug false -e newRunListenerMode true -e log true -e notAnnotation com.android.compatibility.common.util.CtsDownstreamingTest,android.platform.test.annotations.AsbSecurityTest,android.platform.test.annotations.AppModeInstant,android.platform.test.annotations.RestrictedBuildTest -e notTestFile /data/local/tmp/ajur/excludes.txt -e timeout_msec 300000 android.app.cts/androidx.test.runner.AndroidJUnitRunner on unknown-tv_gsi_on_arm-SKBFX9C72AA
12-12 15:03:00 D/InstrumentationTest: Initializing com.android.tradefed.device.metric.CountTestCasesCollector for instrumentation.
12-12 15:03:00 I/RemoteAndroidTestRunner: Running am instrument -w -r --no-hidden-api-checks --abi armeabi-v7a  -e testFile /data/local/tmp/ajur/includes.txt -e debug false -e newRunListenerMode true -e log false -e notAnnotation com.android.compatibility.common.util.CtsDownstreamingTest,android.platform.test.annotations.AsbSecurityTest,android.platform.test.annotations.AppModeInstant,android.platform.test.annotations.RestrictedBuildTest -e notTestFile /data/local/tmp/ajur/excludes.txt -e timeout_msec 300000 android.app.cts/androidx.test.runner.AndroidJUnitRunner on unknown-tv_gsi_on_arm-SKBFX9C72AA
12-12 15:03:01 D/ModuleListener: ModuleListener.testRunStarted(android.app.cts, 1, 0) on SKBFX9C72AA
12-12 15:03:01 D/ModuleListener: ModuleListener.testStarted(android.app.cts.DownloadManagerTest#testDownloadManagerSupportsHttpsWithExternalWebServer) on SKBFX9C72AA
12-12 15:06:01 I/ModuleListener: [1/1] SKBFX9C72AA android.app.cts.DownloadManagerTest#testDownloadManagerSupportsHttpsWithExternalWebServer FAILURE: java.lang.InterruptedException: Timeout waiting for IDs [4]; received [].  Make sure you have WiFi or some other connectivity for this test.
	at android.app.cts.DownloadManagerTestBase$DownloadCompleteReceiver.waitForDownloadComplete(DownloadManagerTestBase.java:525)
	at android.app.cts.DownloadManagerTest.testDownloadManagerSupportsHttpsWithExternalWebServer(DownloadManagerTest.java:183)

12-12 15:06:02 D/ModuleListener: ModuleListener.testRunEnded(181481) on SKBFX9C72AA
12-12 15:06:02 D/RunUtil: Running command [adb, -s, SKBFX9C72AA, shell, settings, put, global, cw_disable_wifimediator, 0] with timeout: 2m 0s
12-12 15:06:03 D/TestDevice: Uninstalling com.android.test.notificationtrampoline.api30 with extra args 
12-12 15:06:03 D/TestDevice: Uninstalling android.app.cts with extra args 
12-12 15:06:03 D/TestDevice: Uninstalling com.android.test.storagedelegator with extra args 
12-12 15:06:04 D/TestDevice: Uninstalling com.android.test.notificationtrampoline.current with extra args 
12-12 15:06:04 D/TestDevice: Uninstalling com.android.app4 with extra args 
12-12 15:06:04 D/TestDevice: Uninstalling com.android.app3 with extra args 
12-12 15:06:05 D/TestDevice: Uninstalling com.android.test.cantsavestate1 with extra args 
12-12 15:06:05 D/TestDevice: Uninstalling com.android.test.notificationdelegator with extra args 
12-12 15:06:06 D/TestDevice: Uninstalling com.android.app2 with extra args 
12-12 15:06:06 D/TestDevice: Uninstalling com.android.test.cantsavestate2 with extra args 
12-12 15:06:06 D/TestDevice: Uninstalling com.android.app1 with extra args 
12-12 15:06:07 D/TestDevice: Uninstalling com.android.cts.stubbad with extra args 
12-12 15:06:07 D/TestDevice: Uninstalling com.android.test.notificationprovider with extra args 
12-12 15:06:07 D/TestDevice: Uninstalling android.app.stubs with extra args 
12-12 15:06:08 D/TestDevice: Uninstalling android.app.cts.activitymanager.api29 with extra args 
12-12 15:06:08 D/TestDevice: Uninstalling com.android.cts.launcherapps.simpleapp with extra args 
12-12 15:06:08 D/TestDevice: Uninstalling com.android.test.notificationlistener with extra args 
12-12 15:06:09 I/NativeDeviceStateMonitor: Device SKBFX9C72AA is already ONLINE
12-12 15:06:09 I/NativeDeviceStateMonitor: Waiting 359999 ms for device SKBFX9C72AA boot complete
12-12 15:06:09 I/DeviceStateMonitor: Waiting 359931 ms for device SKBFX9C72AA package manager
12-12 15:06:09 I/NativeDeviceStateMonitor: Waiting 359864 ms for device SKBFX9C72AA external store
12-12 15:06:09 I/ConsoleReporter: [SKBFX9C72AA] Starting armeabi-v7a CtsAppTestCases with 1 test
12-12 15:06:09 I/ConsoleReporter: [1/1 armeabi-v7a CtsAppTestCases SKBFX9C72AA] android.app.cts.DownloadManagerTest#testDownloadManagerSupportsHttpsWithExternalWebServer fail: java.lang.InterruptedException: Timeout waiting for IDs [4]; received [].  Make sure you have WiFi or some other connectivity for this test.
	at android.app.cts.DownloadManagerTestBase$DownloadCompleteReceiver.waitForDownloadComplete(DownloadManagerTestBase.java:525)
	at android.app.cts.DownloadManagerTest.testDownloadManagerSupportsHttpsWithExternalWebServer(DownloadManagerTest.java:183)

12-12 15:06:09 I/ConsoleReporter: [SKBFX9C72AA] armeabi-v7a CtsAppTestCases completed in 3m 11s. 0 passed, 1 failed, 0 not executed
12-12 15:06:09 I/ITestSuite: Running system status checker after module execution: armeabi-v7a CtsAppTestCases
12-12 15:06:09 D/RunUtil: Running command [adb, -s, SKBFX9C72AA, shell, getprop, ro.build.version.sdk] with timeout: 45s
12-12 15:06:09 D/NativeDevice: Using property ro.build.version.sdk=31 from cache.
12-12 15:06:09 D/NativeDevice: Using property ro.build.version.sdk=31 from cache.
12-12 15:06:09 I/NativeDevice: "enable-root" set to false; ignoring 'adb root' request
12-12 15:06:09 I/NativeDeviceStateMonitor: Device SKBFX9C72AA is already ONLINE
12-12 15:06:09 I/NativeDeviceStateMonitor: Waiting 359999 ms for device SKBFX9C72AA boot complete
12-12 15:06:09 I/DeviceStateMonitor: Waiting 359963 ms for device SKBFX9C72AA package manager
12-12 15:06:10 I/NativeDeviceStateMonitor: Waiting 359901 ms for device SKBFX9C72AA external store
12-12 15:06:11 I/MonitoringUtils: Wifi Connectivity: passed check.
12-12 15:06:12 D/TestDevice: Output from KeyguardController:   KeyguardController:
    mKeyguardShowing=false
    mAodShowing=false
    mKeyguardGoingAway=false

12-12 15:06:12 E/LeakedThreadStatusChecker: We have 4 threads instead of 1. List: [Thread[Invocation-SKBFX9C72AA,5,Invocation-SKBFX9C72AA], Thread[BackgroundDeviceAction-logcat -b all -v threadtime,uid,5,Invocation-SKBFX9C72AA], Thread[Timer-1,5,Invocation-SKBFX9C72AA], Thread[grpc-default-worker-ELG-3-1,5,Invocation-SKBFX9C72AA]]
12-12 15:06:12 W/ITestSuite: System status checker [com.android.tradefed.suite.checker.LeakedThreadStatusChecker] failed
12-12 15:06:12 D/NativeDevice: Time offset = 1088 ms
12-12 15:06:12 D/DeviceSettingChecker: Begin postExecution for checking device setting
12-12 15:06:12 D/NativeDevice: Using property ro.build.version.sdk=31 from cache.
12-12 15:06:12 W/ITestSuite: There are failed system status checkers: {com.android.tradefed.suite.checker.LeakedThreadStatusChecker=We have 4 threads instead of 1. List: [Thread[Invocation-SKBFX9C72AA,5,Invocation-SKBFX9C72AA], Thread[BackgroundDeviceAction-logcat -b all -v threadtime,uid,5,Invocation-SKBFX9C72AA], Thread[Timer-1,5,Invocation-SKBFX9C72AA], Thread[grpc-default-worker-ELG-3-1,5,Invocation-SKBFX9C72AA]]}
12-12 15:06:12 D/FileUtil: Creating temp file at /tmp/xts-root-dir-31f7ed76-90d3-4c87-9d46-ebc367af050b/android-cts/results/2025.12.12_15.02.01/proto with prefix "tmp-proto" suffix ""
12-12 15:06:12 D/PrettyPrintDelimiter: 
=============================
===== TEST PHASE ENDING =====
=============================
12-12 15:06:12 D/LogFileSaver: Log data for device_logcat_test_SKBFX9C72AA is already compressed, skipping compression
12-12 15:06:12 D/FileUtil: Creating temp file at /tmp/xts-root-dir-31f7ed76-90d3-4c87-9d46-ebc367af050b/android-cts/logs/2025.12.12_15.02.01/inv_8470258709435509936 with prefix "device_logcat_test_SKBFX9C72AA_" suffix ".txt"
12-12 15:06:12 I/LogFileSaver: Saved log file /tmp/xts-root-dir-31f7ed76-90d3-4c87-9d46-ebc367af050b/android-cts/logs/2025.12.12_15.02.01/inv_8470258709435509936/device_logcat_test_SKBFX9C72AA_12204368472560835416.txt. [size=346889, elapsed=1ms]
12-12 15:06:12 D/CertificationSuiteResultReporter: Saved logs for device_logcat_test_SKBFX9C72AA in /tmp/xts-root-dir-31f7ed76-90d3-4c87-9d46-ebc367af050b/android-cts/logs/2025.12.12_15.02.01/inv_8470258709435509936/device_logcat_test_SKBFX9C72AA_12204368472560835416.txt
12-12 15:06:12 D/LogFileSaver: Log data for device_logcat_test_SKBFX9C72AA is already compressed, skipping compression
12-12 15:06:12 D/FileUtil: Creating temp file at /tmp/13441469/cts/inv_14577056596028725407/inv_2914749876990745416 with prefix "device_logcat_test_SKBFX9C72AA_" suffix ".txt"
12-12 15:06:12 I/LogFileSaver: Saved log file /tmp/13441469/cts/inv_14577056596028725407/inv_2914749876990745416/device_logcat_test_SKBFX9C72AA_9465077264244894135.txt. [size=346889, elapsed=1ms]
12-12 15:06:12 I/CommandInterrupter: Interrupt blocked
12-12 15:06:12 D/TestInvocation: Testing minimum responsiveness.
12-12 15:06:12 I/NativeDeviceStateMonitor: Device SKBFX9C72AA is already ONLINE
12-12 15:06:12 D/RunUtil: Running command [adb, -s, SKBFX9C72AA, shell, getprop, ro.build.version.sdk] with timeout: 45s
12-12 15:06:12 D/FileUtil: Creating temp file at /tmp/xts-root-dir-31f7ed76-90d3-4c87-9d46-ebc367af050b/android-cts/logs/2025.12.12_15.02.01/inv_8470258709435509936 with prefix "executeShellCommandLog_SKBFX9C72AA_" suffix ".txt.gz"
12-12 15:06:12 I/LogFileSaver: Saved gzip log file /tmp/xts-root-dir-31f7ed76-90d3-4c87-9d46-ebc367af050b/android-cts/logs/2025.12.12_15.02.01/inv_8470258709435509936/executeShellCommandLog_SKBFX9C72AA_18348014669904501360.txt.gz. [size=10, elapsed=1ms]
12-12 15:06:12 D/CertificationSuiteResultReporter: Saved logs for executeShellCommandLog_SKBFX9C72AA in /tmp/xts-root-dir-31f7ed76-90d3-4c87-9d46-ebc367af050b/android-cts/logs/2025.12.12_15.02.01/inv_8470258709435509936/executeShellCommandLog_SKBFX9C72AA_18348014669904501360.txt.gz
12-12 15:06:12 D/FileUtil: Creating temp file at /tmp/13441469/cts/inv_14577056596028725407/inv_2914749876990745416 with prefix "executeShellCommandLog_SKBFX9C72AA_" suffix ".txt.gz"
12-12 15:06:12 I/LogFileSaver: Saved gzip log file /tmp/13441469/cts/inv_14577056596028725407/inv_2914749876990745416/executeShellCommandLog_SKBFX9C72AA_1673036074144543570.txt.gz. [size=10, elapsed=0ms]
12-12 15:06:12 D/TestInvocation: Checking that devices are online.
12-12 15:06:12 I/NativeDeviceStateMonitor: Device SKBFX9C72AA is already ONLINE
12-12 15:06:12 I/NativeDeviceStateMonitor: Waiting 179999 ms for device SKBFX9C72AA boot complete
12-12 15:06:12 I/DeviceStateMonitor: Waiting 179963 ms for device SKBFX9C72AA package manager
12-12 15:06:12 I/NativeDeviceStateMonitor: Waiting 179901 ms for device SKBFX9C72AA external store
12-12 15:06:13 D/InvocationExecution: starting tearDown 'com.android.compatibility.common.tradefed.targetprep.PropertyCheck@1c232509' on device: 'SKBFX9C72AA'
12-12 15:06:13 D/InvocationExecution: done with tearDown 'com.android.compatibility.common.tradefed.targetprep.PropertyCheck@1c232509' on device: 'SKBFX9C72AA' in 1 ms
12-12 15:06:13 D/InvocationExecution: starting tearDown 'com.android.compatibility.common.tradefed.targetprep.PropertyCheck@62e1eb' on device: 'SKBFX9C72AA'
12-12 15:06:13 D/InvocationExecution: done with tearDown 'com.android.compatibility.common.tradefed.targetprep.PropertyCheck@62e1eb' on device: 'SKBFX9C72AA' in 0 ms
12-12 15:06:13 D/InvocationExecution: starting tearDown 'com.android.compatibility.common.tradefed.targetprep.PropertyCheck@59818d12' on device: 'SKBFX9C72AA'
12-12 15:06:13 D/InvocationExecution: done with tearDown 'com.android.compatibility.common.tradefed.targetprep.PropertyCheck@59818d12' on device: 'SKBFX9C72AA' in 0 ms
12-12 15:06:13 D/InvocationExecution: starting tearDown 'com.android.tradefed.targetprep.RunCommandTargetPreparer@4183b5d2' on device: 'SKBFX9C72AA'
12-12 15:06:13 D/RunUtil: Running command [adb, -s, SKBFX9C72AA, shell, settings, put, global, verifier_engprod, 0] with timeout: 2m 0s
12-12 15:06:13 D/InvocationExecution: done with tearDown 'com.android.tradefed.targetprep.RunCommandTargetPreparer@4183b5d2' on device: 'SKBFX9C72AA' in 70 ms
12-12 15:06:13 D/InvocationExecution: starting tearDown 'com.android.tradefed.targetprep.RunCommandTargetPreparer@3a965799' on device: 'SKBFX9C72AA'
12-12 15:06:13 D/RunUtil: Running command [adb, -s, SKBFX9C72AA, shell, settings, put, global, package_verifier_enable, 1] with timeout: 2m 0s
12-12 15:06:13 D/InvocationExecution: done with tearDown 'com.android.tradefed.targetprep.RunCommandTargetPreparer@3a965799' on device: 'SKBFX9C72AA' in 67 ms
12-12 15:06:13 D/InvocationExecution: starting tearDown 'com.android.compatibility.common.tradefed.targetprep.ReportLogCollector@70b67ebf' on device: 'SKBFX9C72AA'
12-12 15:06:13 D/NativeDevice: Using property ro.build.version.sdk=31 from cache.
12-12 15:06:13 D/NativeDevice: Using 'ls' to check doesFileExist(/storage/emulated/0/report-log-files/)
12-12 15:06:13 D/RunUtil: Running command [adb, -s, SKBFX9C72AA, shell, ls, '/storage/emulated/0/report-log-files/'] with timeout: 2m 0s
12-12 15:06:13 D/NativeDevice: File /storage/emulated/0/report-log-files/ does not exist.
stdout: 
stderr: ls: /storage/emulated/0/report-log-files/: No such file or directory

12-12 15:06:13 E/NativeDevice: Device path /sdcard/report-log-files/ does not exist to be pulled.
12-12 15:06:13 D/InvocationExecution: done with tearDown 'com.android.compatibility.common.tradefed.targetprep.ReportLogCollector@70b67ebf' on device: 'SKBFX9C72AA' in 114 ms
12-12 15:06:13 D/InvocationExecution: starting tearDown 'com.android.compatibility.common.tradefed.targetprep.DeviceInfoCollector@781926f4' on device: 'SKBFX9C72AA'
12-12 15:06:13 D/InvocationExecution: done with tearDown 'com.android.compatibility.common.tradefed.targetprep.DeviceInfoCollector@781926f4' on device: 'SKBFX9C72AA' in 3 ms
12-12 15:06:13 D/InvocationExecution: starting tearDown 'com.android.tradefed.targetprep.RunCommandTargetPreparer@8d1bafc' on device: 'SKBFX9C72AA'
12-12 15:06:13 D/InvocationExecution: done with tearDown 'com.android.tradefed.targetprep.RunCommandTargetPreparer@8d1bafc' on device: 'SKBFX9C72AA' in 0 ms
12-12 15:06:13 D/InvocationExecution: starting tearDown 'com.android.compatibility.common.tradefed.targetprep.WifiCheck@10872a8d' on device: 'SKBFX9C72AA'
12-12 15:06:13 D/InvocationExecution: done with tearDown 'com.android.compatibility.common.tradefed.targetprep.WifiCheck@10872a8d' on device: 'SKBFX9C72AA' in 0 ms
12-12 15:06:13 D/InvocationExecution: starting tearDown 'com.android.compatibility.common.tradefed.targetprep.ApkPreconditionCheck@2c47ba81' on device: 'SKBFX9C72AA'
12-12 15:06:13 D/InvocationExecution: done with tearDown 'com.android.compatibility.common.tradefed.targetprep.ApkPreconditionCheck@2c47ba81' on device: 'SKBFX9C72AA' in 0 ms
12-12 15:06:13 D/InvocationExecution: starting tearDown 'com.android.compatibility.common.tradefed.targetprep.SettingsPreparer@66c11ac7' on device: 'SKBFX9C72AA'
12-12 15:06:13 D/InvocationExecution: done with tearDown 'com.android.compatibility.common.tradefed.targetprep.SettingsPreparer@66c11ac7' on device: 'SKBFX9C72AA' in 0 ms
12-12 15:06:13 D/InvocationExecution: starting tearDown 'com.android.compatibility.common.tradefed.targetprep.SettingsPreparer@5990379d' on device: 'SKBFX9C72AA'
12-12 15:06:13 D/InvocationExecution: done with tearDown 'com.android.compatibility.common.tradefed.targetprep.SettingsPreparer@5990379d' on device: 'SKBFX9C72AA' in 0 ms
12-12 15:06:13 D/InvocationExecution: starting tearDown 'com.android.compatibility.common.tradefed.targetprep.PackageDisabler@6300cd28' on device: 'SKBFX9C72AA'
12-12 15:06:13 D/InvocationExecution: done with tearDown 'com.android.compatibility.common.tradefed.targetprep.PackageDisabler@6300cd28' on device: 'SKBFX9C72AA' in 1 ms
12-12 15:06:13 D/InvocationExecution: starting tearDown 'com.android.compatibility.common.tradefed.targetprep.StayAwakePreparer@48311a00' on device: 'SKBFX9C72AA'
12-12 15:06:13 D/InvocationExecution: done with tearDown 'com.android.compatibility.common.tradefed.targetprep.StayAwakePreparer@48311a00' on device: 'SKBFX9C72AA' in 0 ms
12-12 15:06:13 D/InvocationExecution: starting tearDown 'com.android.compatibility.common.tradefed.targetprep.DynamicConfigPusher@4d3d1850' on device: 'SKBFX9C72AA'
12-12 15:06:13 D/InvocationExecution: done with tearDown 'com.android.compatibility.common.tradefed.targetprep.DynamicConfigPusher@4d3d1850' on device: 'SKBFX9C72AA' in 0 ms
12-12 15:06:13 D/InvocationExecution: starting tearDown 'com.android.compatibility.common.tradefed.targetprep.DeviceFileCollector@7ef1cade' on device: 'SKBFX9C72AA'
12-12 15:06:13 D/InvocationExecution: done with tearDown 'com.android.compatibility.common.tradefed.targetprep.DeviceFileCollector@7ef1cade' on device: 'SKBFX9C72AA' in 1 ms
12-12 15:06:13 D/InvocationExecution: starting tearDown 'com.android.compatibility.common.tradefed.targetprep.DeviceFileCollector@3861a1f9' on device: 'SKBFX9C72AA'
12-12 15:06:13 D/InvocationExecution: done with tearDown 'com.android.compatibility.common.tradefed.targetprep.DeviceFileCollector@3861a1f9' on device: 'SKBFX9C72AA' in 0 ms
12-12 15:06:13 D/InvocationExecution: starting tearDown 'com.android.compatibility.common.tradefed.targetprep.VtsDeviceInfoCollector@23ad5bac' on device: 'SKBFX9C72AA'
12-12 15:06:13 D/InvocationExecution: done with tearDown 'com.android.compatibility.common.tradefed.targetprep.VtsDeviceInfoCollector@23ad5bac' on device: 'SKBFX9C72AA' in 0 ms
12-12 15:06:13 D/TestDevice: Uninstalling com.android.tradefed.utils.wifi with extra args 
12-12 15:06:13 D/WifiHelper: Successfully clean up WifiHelper.
12-12 15:06:13 D/RunUtil: Running command [id, -u, dev2-google03] with timeout: 1m 0s
12-12 15:06:13 D/RunUtil: Running command [tail, -c, 10MB, /tmp/adb.1000.log] with timeout: 1m 0s
12-12 15:06:13 D/LogFileSaver: Log data for host_adb_log is already compressed, skipping compression
12-12 15:06:13 D/FileUtil: Creating temp file at /tmp/xts-root-dir-31f7ed76-90d3-4c87-9d46-ebc367af050b/android-cts/logs/2025.12.12_15.02.01/inv_8470258709435509936 with prefix "host_adb_log_" suffix ".txt"
12-12 15:06:13 I/LogFileSaver: Saved log file /tmp/xts-root-dir-31f7ed76-90d3-4c87-9d46-ebc367af050b/android-cts/logs/2025.12.12_15.02.01/inv_8470258709435509936/host_adb_log_16760584950241989481.txt. [size=226915, elapsed=1ms]
12-12 15:06:13 D/CertificationSuiteResultReporter: Saved logs for host_adb_log in /tmp/xts-root-dir-31f7ed76-90d3-4c87-9d46-ebc367af050b/android-cts/logs/2025.12.12_15.02.01/inv_8470258709435509936/host_adb_log_16760584950241989481.txt
12-12 15:06:13 D/LogFileSaver: Log data for host_adb_log is already compressed, skipping compression
12-12 15:06:13 D/FileUtil: Creating temp file at /tmp/13441469/cts/inv_14577056596028725407/inv_2914749876990745416 with prefix "host_adb_log_" suffix ".txt"
12-12 15:06:13 I/LogFileSaver: Saved log file /tmp/13441469/cts/inv_14577056596028725407/inv_2914749876990745416/host_adb_log_12871148075050185111.txt. [size=226915, elapsed=1ms]
12-12 15:06:13 D/LogFileSaver: Log data for device_logcat_teardown_SKBFX9C72AA is already compressed, skipping compression
12-12 15:06:13 D/FileUtil: Creating temp file at /tmp/xts-root-dir-31f7ed76-90d3-4c87-9d46-ebc367af050b/android-cts/logs/2025.12.12_15.02.01/inv_8470258709435509936 with prefix "device_logcat_teardown_SKBFX9C72AA_" suffix ".txt"
12-12 15:06:13 I/LogFileSaver: Saved log file /tmp/xts-root-dir-31f7ed76-90d3-4c87-9d46-ebc367af050b/android-cts/logs/2025.12.12_15.02.01/inv_8470258709435509936/device_logcat_teardown_SKBFX9C72AA_17209081983957970936.txt. [size=3689, elapsed=0ms]
12-12 15:06:13 D/CertificationSuiteResultReporter: Saved logs for device_logcat_teardown_SKBFX9C72AA in /tmp/xts-root-dir-31f7ed76-90d3-4c87-9d46-ebc367af050b/android-cts/logs/2025.12.12_15.02.01/inv_8470258709435509936/device_logcat_teardown_SKBFX9C72AA_17209081983957970936.txt
12-12 15:06:13 D/LogFileSaver: Log data for device_logcat_teardown_SKBFX9C72AA is already compressed, skipping compression
12-12 15:06:13 D/FileUtil: Creating temp file at /tmp/13441469/cts/inv_14577056596028725407/inv_2914749876990745416 with prefix "device_logcat_teardown_SKBFX9C72AA_" suffix ".txt"
12-12 15:06:13 I/LogFileSaver: Saved log file /tmp/13441469/cts/inv_14577056596028725407/inv_2914749876990745416/device_logcat_teardown_SKBFX9C72AA_2546899377655400333.txt. [size=3689, elapsed=0ms]
12-12 15:06:13 I/TestInvocation: Done stopping logcat for SKBFX9C72AA
12-12 15:06:13 D/BackgroundDeviceAction: com.android.ddmlib.TimeoutException while running logcat on SKBFX9C72AA. May see duplicated content in log.
12-12 15:06:13 D/BackgroundDeviceAction: Waiting for device SKBFX9C72AA online before starting.
12-12 15:06:13 D/CommandScheduler: TestDeviceState for releasing 'SKBFX9C72AA(class com.android.tradefed.device.TestDevice)' is 'ONLINE'
12-12 15:06:13 I/NativeDeviceStateMonitor: Waiting 30000 ms for device SKBFX9C72AA shell to be responsive
12-12 15:06:13 I/NativeDeviceStateMonitor: shell ready. id output: uid=2000(shell) gid=2000(shell) groups=2000(shell),1004(input),1007(log),1011(adb),1015(sdcard_rw),1028(sdcard_r),1078(ext_data_rw),1079(ext_obb_rw),3001(net_bt_admin),3002(net_bt),3003(inet),3006(net_bw_stats),3009(readproc),3011(uhid) context=u:r:shell:s0

12-12 15:06:13 D/CommandScheduler: Release map of the devices: {com.android.tradefed.device.TestDevice@7259c3ba=AVAILABLE}
12-12 15:06:13 W/NativeDevice: Attempting to stop logcat when not capturing for SKBFX9C72AA
12-12 15:06:13 D/TestDevice: No snapuserd notification in progress for BLOCK_BEFORE_RELEASING
